program: Orca
programVersion: 5.0.2
elementType: Cl Cl S S P O O C C C C C C C C C C C H H H H H H H H H H H H H H H
charge: 0
multiplicity: 1
keywords: wb97x-d3
keywords: def2-TZVPP
keywords: def2/J RIJCOSX
keywords: DEFGRID2
keywords: scfconv7
keywords: smallprint printgap noloewdin
keywords: NOSOSCF
formula: C11H15Cl2O2PS2
InChI: InChI=1/C11H15Cl2O2PS2/c1-3-7-18-16(17,14-4-2)15-11-6-5-9(12)8-10(11)13/h5-6,8H,3-4,7H2,1-2H3
33 atoms
Cl -1.440411 -1.801976 1.328256
Cl -5.296933 1.532714 -0.33569
S  3.043683 -0.929118 -0.481553
S  1.179688 0.941027 1.711963
P  1.456676 0.337651 -0.089845
O  0.195247 -0.48154 -0.738663
O  1.667894 1.45898 -1.209729
C  3.101822 -1.969512 1.023641
C  2.214486 -3.197417 0.962395
C  2.612834 -4.185283 -0.119632
C  -1.077828 0.021538 -0.630261
C  2.282188 2.736541 -0.930214
C  -1.955103 -0.521361 0.30199
C  -1.515194 1.03125 -1.472454
C  3.775405 2.635533 -0.747085
C  -3.258289 -0.060272 0.397532
C  -2.814173 1.50284 -1.387802
C  -3.672217 0.954769 -0.448811
H  2.864274 -1.33328 1.876643
H  4.152978 -2.249544 1.111043
H  2.277152 -3.681137 1.941026
H  1.173647 -2.895484 0.836647
H  2.527139 -3.749618 -1.115934
H  3.643774 -4.518008 0.010811
H  1.974786 -5.068527 -0.094035
H  2.035585 3.351216 -1.793739
H  1.805816 3.17876 -0.053964
H  -0.845381 1.443254 -2.214288
H  4.044148 2.082403 0.152851
H  4.2552 2.163134 -1.603864
H  4.1827 3.642129 -0.648332
H  -3.934079 -0.488595 1.12464
H  -3.145804 2.288338 -2.051839
elementType: Cl S P O C H
totalener: -2636.99726832 hartree
nucrepener: 2138.13094463 hartree
electener: -4775.12821294 hartree
oneelecener: -7888.75580630 hartree
twoeener: 3113.62759336 hartree
cpcmener: -0.01668605 hartree
kineticenergy: 2631.02173567 hartree
xcener: -154.152782641620 hartree
chargesum: 0.0000000
charge: -0.062585 -0.082926 -0.150492 -0.422008 0.635647 -0.350331 -0.361602 -0.106513 -0.085746 -0.258699 0.211072 0.043801 0.009852 -0.158455 -0.243231 -0.097176 -0.135681 0.060021 0.125843 0.129123 0.077817 0.047712 0.073477 0.087716 0.092683 0.109428 0.096209 0.160785 0.076722 0.091311 0.103550 0.132600 0.150076
qa: -0.0626 -0.0829 -0.1505 -0.4220 0.6356 -0.3503 -0.3616 -0.1065 -0.0857 -0.2587 0.2111 0.0438 0.0099 -0.1585 -0.2432 -0.0972 -0.1357 0.0600 0.1258 0.1291 0.0778 0.0477 0.0735 0.0877 0.0927 0.1094 0.0962 0.1608 0.0767 0.0913 0.1035 0.1326 0.1501
va: 1.2437 1.2177 2.3126 2.0301 5.3803 2.0930 2.1092 3.8537 3.8765 3.9395 3.8040 3.8398 3.9931 4.0084 3.9066 3.9983 3.9906 3.8787 1.0355 1.0033 1.0111 1.0419 1.0138 1.0011 1.0047 0.9906 1.0128 1.0025 1.0165 1.0042 1.0104 1.0141 1.0007
dispcorr: -0.018090049 hartree
energy: -2637.015358365088
dipole: 33.13956 -32.09681 1.04275 -5.35257 5.70769 0.35512 -3.72816 2.96196 -0.76620
magnitude: 1.34183 au
magnitude: 3.41066 debye
