program: Orca
programVersion: 5.0.2
elementType: Cl Cl S S P O O C C C C C C C C C C C H H H H H H H H H H H H H H H
charge: 0
multiplicity: 1
keywords: wb97x-d3
keywords: def2-TZVPP
keywords: def2/J RIJCOSX
keywords: DEFGRID2
keywords: scfconv7
keywords: smallprint printgap noloewdin
keywords: NOSOSCF
formula: C11H15Cl2O2PS2
InChI: InChI=1/C11H15Cl2O2PS2/c1-3-7-18-16(17,14-4-2)15-11-6-5-9(12)8-10(11)13/h5-6,8H,3-4,7H2,1-2H3
33 atoms
Cl -1.653273 -2.398469 -0.063661
Cl -4.808648 1.743179 -1.367655
S  2.797186 -1.373014 1.271998
S  2.0796 1.70919 2.042452
P  1.588664 0.247685 0.890614
O  0.0888 -0.373444 1.065677
O  1.546922 0.558909 -0.675749
C  2.070676 -2.790991 0.36111
C  2.005889 -2.673377 -1.149826
C  3.335595 -2.357327 -1.810412
C  -1.028867 0.168244 0.489413
C  2.431642 1.521424 -1.295359
C  -1.953011 -0.703049 -0.076626
C  -1.288502 1.53055 0.482998
C  1.710561 2.822533 -1.533685
C  -3.123116 -0.226222 -0.644756
C  -2.4476 2.021497 -0.093053
C  -3.355832 1.138477 -0.652239
H  1.094913 -3.005558 0.791524
H  2.736224 -3.607222 0.650452
H  1.639436 -3.639647 -1.506789
H  1.249545 -1.943869 -1.440392
H  3.701686 -1.366058 -1.540302
H  4.101628 -3.08064 -1.525167
H  3.241461 -2.386517 -2.896045
H  3.320656 1.669091 -0.679994
H  2.747741 1.064819 -2.231669
H  -0.594138 2.223614 0.939002
H  1.406183 3.29029 -0.597719
H  2.381903 3.510985 -2.048319
H  0.829754 2.683037 -2.160433
H  -3.833826 -0.915371 -1.079566
H  -2.633974 3.086097 -0.093947
elementType: Cl S P O C H
totalener: -2636.99561224 hartree
nucrepener: 2157.40057010 hartree
electener: -4794.39618233 hartree
oneelecener: -7926.26573187 hartree
twoeener: 3131.86954954 hartree
cpcmener: -0.01776159 hartree
kineticenergy: 2630.99678695 hartree
xcener: -154.151772026072 hartree
chargesum: -0.0000000
charge: -0.069962 -0.084358 -0.147234 -0.434445 0.613324 -0.341012 -0.324319 -0.122527 -0.103967 -0.260720 0.256757 0.049196 0.011938 -0.194674 -0.240942 -0.097524 -0.133525 0.057759 0.127120 0.138722 0.091138 0.051125 0.065400 0.093353 0.097173 0.094059 0.107122 0.147896 0.076320 0.106132 0.089573 0.131846 0.149256
qa: -0.0700 -0.0844 -0.1472 -0.4344 0.6133 -0.3410 -0.3243 -0.1225 -0.1040 -0.2607 0.2568 0.0492 0.0119 -0.1947 -0.2409 -0.0975 -0.1335 0.0578 0.1271 0.1387 0.0911 0.0511 0.0654 0.0934 0.0972 0.0941 0.1071 0.1479 0.0763 0.1061 0.0896 0.1318 0.1493
va: 1.2409 1.2165 2.3369 2.0226 5.3941 2.1227 2.0543 3.8746 3.8739 3.9463 3.7538 3.8136 3.9669 3.9422 3.9365 4.0043 4.0144 3.8851 1.0247 1.0019 1.0055 1.0272 1.0101 1.0020 1.0035 1.0116 0.9911 1.0155 1.0143 1.0095 1.0041 1.0143 1.0017
dispcorr: -0.020142049 hartree
energy: -2637.015754286566
dipole: 27.06829 -26.79045 0.27784 -1.65190 1.06754 -0.58436 -13.51167 11.59072 -1.92095
magnitude: 2.02699 au
magnitude: 5.15221 debye
