program: Orca
programVersion: 5.0.2
elementType: Cl Cl S S P O O C C C C C C C C C C C H H H H H H H H H H H H H H H
charge: 0
multiplicity: 1
keywords: wb97x-d3
keywords: def2-TZVPP
keywords: def2/J RIJCOSX
keywords: DEFGRID2
keywords: scfconv7
keywords: smallprint printgap noloewdin
keywords: NOSOSCF
formula: C11H15Cl2O2PS2
InChI: InChI=1/C11H15Cl2O2PS2/c1-3-7-18-16(17,14-4-2)15-11-6-5-9(12)8-10(11)13/h5-6,8H,3-4,7H2,1-2H3
33 atoms
Cl -1.194586 1.721056 2.190752
Cl -4.756305 0.75197 -1.71139
S  2.356394 -1.62187 -1.004825
S  3.095433 0.4484 1.611253
P  1.87127 -0.014741 0.209623
O  0.395152 -0.311352 0.872072
O  1.579852 1.031141 -0.955884
C  3.070858 -2.777973 0.221631
C  2.085482 -3.353341 1.221479
C  0.919334 -4.089848 0.589377
C  -0.792629 -0.086628 0.233152
C  1.37343 2.441465 -0.682483
C  -1.655493 0.863161 0.770755
C  -1.17051 -0.782138 -0.90392
C  0.348946 2.970386 -1.65029
C  -2.882294 1.124086 0.182912
C  -2.390524 -0.526953 -1.507483
C  -3.23284 0.427343 -0.961491
H  3.897844 -2.268116 0.714962
H  3.496414 -3.567026 -0.401114
H  2.6564 -4.038545 1.854204
H  1.72297 -2.567071 1.887143
H  1.266293 -4.86373 -0.097528
H  0.308119 -4.572409 1.351732
H  0.269206 -3.416831 0.028629
H  1.045199 2.590883 0.347914
H  2.333954 2.942685 -0.800909
H  -0.521442 -1.539509 -1.322293
H  0.226721 4.04032 -1.482038
H  0.661777 2.82925 -2.684454
H  -0.622328 2.495403 -1.508138
H  -3.543564 1.864701 0.611057
H  -2.675314 -1.074959 -2.394474
elementType: Cl S P O C H
totalener: -2636.99601542 hartree
nucrepener: 2166.23852925 hartree
electener: -4803.23454467 hartree
oneelecener: -7944.05665536 hartree
twoeener: 3140.82211069 hartree
cpcmener: -0.01880255 hartree
kineticenergy: 2631.00858118 hartree
xcener: -154.150835061939 hartree
chargesum: -0.0000000
charge: -0.067806 -0.084441 -0.147138 -0.413741 0.601593 -0.340606 -0.340593 -0.113973 -0.100008 -0.254378 0.219862 0.011017 0.007679 -0.138787 -0.233258 -0.099443 -0.155853 0.076599 0.126573 0.132902 0.086334 0.056243 0.089067 0.096262 0.070326 0.098186 0.125195 0.142494 0.097917 0.096148 0.074818 0.131467 0.149344
qa: -0.0678 -0.0844 -0.1471 -0.4137 0.6016 -0.3406 -0.3406 -0.1140 -0.1000 -0.2544 0.2199 0.0110 0.0077 -0.1388 -0.2333 -0.0994 -0.1559 0.0766 0.1266 0.1329 0.0863 0.0562 0.0891 0.0963 0.0703 0.0982 0.1252 0.1425 0.0979 0.0961 0.0748 0.1315 0.1493
va: 1.2454 1.2153 2.2945 2.0573 5.3992 2.0622 2.0872 3.8717 3.8543 3.9464 3.7856 3.8368 3.9331 3.9424 3.9344 4.0160 4.0546 3.8668 1.0261 1.0033 1.0075 1.0304 1.0016 1.0057 0.9985 1.0069 1.0038 1.0106 1.0084 1.0049 1.0092 1.0168 1.0025
dispcorr: -0.020360859 hartree
energy: -2637.016376277618
dipole: 15.69433 -16.17926 -0.48493 -13.84943 13.21890 -0.63053 -4.74041 3.62735 -1.11306
magnitude: 1.36807 au
magnitude: 3.47736 debye
