program: Orca
programVersion: 5.0.2
elementType: Cl Cl S S P O O C C C C C C C C C C C H H H H H H H H H H H H H H H
charge: 0
multiplicity: 1
keywords: wb97x-d3
keywords: def2-TZVPP
keywords: def2/J RIJCOSX
keywords: DEFGRID2
keywords: scfconv7
keywords: smallprint printgap noloewdin
keywords: NOSOSCF
formula: C11H15Cl2O2PS2
InChI: InChI=1/C11H15Cl2O2PS2/c1-3-7-18-16(17,14-4-2)15-11-6-5-9(12)8-10(11)13/h5-6,8H,3-4,7H2,1-2H3
33 atoms
Cl -0.823318 2.679395 -0.79336
Cl -5.200723 -0.359084 -0.130988
S  2.197809 -1.774538 1.188865
S  0.846867 0.968467 2.378642
P  1.611627 0.163244 0.814126
O  0.617459 0.152086 -0.491988
O  2.898484 0.817174 0.151492
C  2.965291 -2.346077 -0.381545
C  1.999578 -2.993752 -1.355952
C  1.335152 -4.248326 -0.816325
C  -0.734949 0.018956 -0.366254
C  2.975745 2.231471 -0.163687
C  -1.54248 1.141703 -0.507968
C  -1.314176 -1.218065 -0.138318
C  2.916772 2.450287 -1.652923
C  -2.921426 1.032475 -0.441797
C  -2.690934 -1.342392 -0.061701
C  -3.480606 -0.214471 -0.214677
H  3.716462 -3.064827 -0.048857
H  3.503467 -1.514077 -0.831892
H  1.248617 -2.271015 -1.678649
H  2.581498 -3.245571 -2.246797
H  0.723628 -4.041128 0.063408
H  0.6844 -4.696566 -1.566947
H  2.078393 -4.996131 -0.533884
H  2.183936 2.775766 0.354149
H  3.927359 2.567197 0.244922
H  -0.688814 -2.095238 -0.032254
H  3.075306 3.509747 -1.856514
H  3.697875 1.892802 -2.169512
H  1.950987 2.170287 -2.071111
H  -3.54403 1.908406 -0.560423
H  -3.134535 -2.312077 0.11481
elementType: Cl S P O C H
totalener: -2636.99861866 hartree
nucrepener: 2153.66459589 hartree
electener: -4790.66321455 hartree
oneelecener: -7919.22508448 hartree
twoeener: 3128.56186993 hartree
cpcmener: -0.02006059 hartree
kineticenergy: 2631.01854160 hartree
xcener: -154.152598057416 hartree
chargesum: -0.0000000
charge: -0.063338 -0.084046 -0.146414 -0.425687 0.599442 -0.351905 -0.340201 -0.115075 -0.108914 -0.263569 0.199052 0.041616 0.044698 -0.087093 -0.234273 -0.126200 -0.194961 0.100920 0.125174 0.133232 0.067921 0.087782 0.074517 0.096147 0.093398 0.082473 0.114665 0.142872 0.099263 0.094135 0.067493 0.130930 0.145944
qa: -0.0633 -0.0840 -0.1464 -0.4257 0.5994 -0.3519 -0.3402 -0.1151 -0.1089 -0.2636 0.1991 0.0416 0.0447 -0.0871 -0.2343 -0.1262 -0.1950 0.1009 0.1252 0.1332 0.0679 0.0878 0.0745 0.0961 0.0934 0.0825 0.1147 0.1429 0.0993 0.0941 0.0675 0.1309 0.1459
va: 1.2500 1.2167 2.3157 2.0344 5.4193 2.0432 2.0974 3.8822 3.8957 3.9218 3.7394 3.8403 3.9797 3.9424 3.9295 4.0408 4.0936 3.8368 1.0058 1.0231 1.0134 1.0098 1.0065 1.0040 1.0008 1.0169 0.9965 0.9859 1.0068 1.0054 1.0250 1.0150 1.0052
dispcorr: -0.019515900 hartree
energy: -2637.018134563320
dipole: 27.05700 -25.87509 1.18192 -15.73130 14.77519 -0.95611 -12.08195 10.01510 -2.06685
magnitude: 2.56573 au
magnitude: 6.52156 debye
