program: Orca
programVersion: 5.0.2
elementType: Cl Cl S S P O O C C C C C C C C C C C H H H H H H H H H H H H H H H
charge: 0
multiplicity: 1
keywords: wb97x-d3
keywords: def2-TZVPP
keywords: def2/J RIJCOSX
keywords: DEFGRID2
keywords: scfconv7
keywords: smallprint printgap noloewdin
keywords: NOSOSCF
formula: C11H15Cl2O2PS2
InChI: InChI=1/C11H15Cl2O2PS2/c1-3-7-18-16(17,14-4-2)15-11-6-5-9(12)8-10(11)13/h5-6,8H,3-4,7H2,1-2H3
33 atoms
Cl -1.325756 0.202995 2.52522
Cl -5.038567 0.001535 -1.347361
S  1.237934 -1.570146 -0.763986
S  3.151847 0.465406 1.260118
P  1.813347 0.300835 -0.105437
O  0.448205 1.050369 0.410156
O  2.141247 0.924406 -1.537731
C  0.835068 -2.403711 0.825965
C  1.645946 -3.677138 0.992464
C  3.130259 -3.43351 1.199056
C  -0.812568 0.803264 -0.050557
C  2.950747 2.116613 -1.68565
C  -1.770846 0.399932 0.873922
C  -1.172938 0.964873 -1.379321
C  2.267652 3.357479 -1.167794
C  -3.078215 0.160924 0.485231
C  -2.474224 0.71972 -1.784488
C  -3.413218 0.316166 -0.849312
H  -0.233249 -2.610459 0.799657
H  1.025161 -1.717959 1.652299
H  1.232728 -4.199767 1.859063
H  1.4821 -4.335463 0.136008
H  3.579408 -2.928962 0.342839
H  3.308088 -2.811687 2.07704
H  3.659492 -4.375314 1.343295
H  3.909478 1.95687 -1.189412
H  3.131417 2.188119 -2.75587
H  -0.44433 1.289507 -2.10939
H  2.879055 4.222631 -1.425885
H  1.285684 3.49731 -1.619931
H  2.158448 3.348824 -0.083271
H  -3.814958 -0.1464 1.21439
H  -2.743577 0.843536 -2.82396
elementType: Cl S P O C H
totalener: -2636.99501731 hartree
nucrepener: 2153.04684485 hartree
electener: -4790.04186216 hartree
oneelecener: -7917.92577275 hartree
twoeener: 3127.88391059 hartree
cpcmener: -0.01846008 hartree
kineticenergy: 2631.01344335 hartree
xcener: -154.151694291693 hartree
chargesum: 0.0000000
charge: -0.068508 -0.084450 -0.151204 -0.417255 0.610133 -0.334770 -0.345592 -0.086257 -0.085135 -0.260511 0.203495 0.028638 0.006175 -0.140488 -0.245691 -0.089282 -0.142107 0.064743 0.132484 0.081899 0.077392 0.070917 0.069724 0.077924 0.098190 0.102466 0.113557 0.154803 0.105411 0.093681 0.080842 0.129881 0.148897
qa: -0.0685 -0.0844 -0.1512 -0.4173 0.6101 -0.3348 -0.3456 -0.0863 -0.0851 -0.2605 0.2035 0.0286 0.0062 -0.1405 -0.2457 -0.0893 -0.1421 0.0647 0.1325 0.0819 0.0774 0.0709 0.0697 0.0779 0.0982 0.1025 0.1136 0.1548 0.1054 0.0937 0.0808 0.1299 0.1489
va: 1.2440 1.2165 2.2951 2.0432 5.4005 2.0805 2.0912 3.8718 3.9213 3.9273 3.7891 3.8370 3.9437 3.9421 3.8939 4.0144 4.0149 3.8725 1.0063 1.0416 1.0080 1.0116 1.0166 1.0042 1.0083 1.0122 0.9926 1.0070 1.0089 1.0032 1.0196 1.0161 1.0018
dispcorr: -0.019398546 hartree
energy: -2637.014415861092
dipole: 25.66632 -26.15559 -0.48927 -5.86792 5.86375 -0.00417 -4.03945 2.78180 -1.25765
magnitude: 1.34948 au
magnitude: 3.43010 debye
