program: Orca
programVersion: 5.0.2
elementType: Cl Cl S S P O O C C C C C C C C C C C H H H H H H H H H H H H H H H
charge: 0
multiplicity: 1
keywords: wb97x-d3
keywords: def2-TZVPP
keywords: def2/J RIJCOSX
keywords: DEFGRID2
keywords: scfconv7
keywords: smallprint printgap noloewdin
keywords: NOSOSCF
formula: C11H15Cl2O2PS2
InChI: InChI=1/C11H15Cl2O2PS2/c1-3-7-18-16(17,14-4-2)15-11-6-5-9(12)8-10(11)13/h5-6,8H,3-4,7H2,1-2H3
33 atoms
Cl -0.753959 1.728676 -2.079128
Cl -5.528933 -0.205975 -0.56048
S  1.241749 -0.876654 -0.903735
S  1.077015 -0.985503 2.500842
P  1.2232 0.105794 0.930004
O  0.020273 1.190553 0.68171
O  2.455147 1.105971 1.013483
C  2.108643 -2.423104 -0.454653
C  3.593097 -2.253064 -0.194277
C  4.252382 -3.593678 0.092372
C  -1.269389 0.826369 0.406989
C  2.839482 1.99258 -0.068675
C  -1.772174 1.046345 -0.870444
C  -2.092414 0.296073 1.386703
C  4.160428 1.564871 -0.65111
C  -3.086611 0.736377 -1.176411
C  -3.407198 -0.024904 1.093723
C  -3.889471 0.19364 -0.186436
H  1.937299 -3.070989 -1.316411
H  1.591329 -2.866468 0.396845
H  4.062859 -1.782768 -1.060296
H  3.750187 -1.580998 0.65238
H  3.821386 -4.068147 0.975218
H  4.136637 -4.282409 -0.745841
H  5.320289 -3.469557 0.272531
H  2.067996 2.025477 -0.839481
H  2.903791 2.986165 0.372318
H  -1.711359 0.145825 2.387292
H  4.087424 0.598863 -1.149683
H  4.472073 2.301061 -1.392717
H  4.937941 1.510032 0.110401
H  -3.470229 0.913229 -2.171578
H  -4.043529 -0.438054 1.86338
elementType: Cl S P O C H
totalener: -2636.99771890 hartree
nucrepener: 2137.89730355 hartree
electener: -4774.89502244 hartree
oneelecener: -7887.75456379 hartree
twoeener: 3112.85954134 hartree
cpcmener: -0.01748204 hartree
kineticenergy: 2631.01702138 hartree
xcener: -154.153552225451 hartree
chargesum: -0.0000000
charge: -0.063646 -0.082983 -0.180582 -0.416142 0.620267 -0.353245 -0.341461 -0.062881 -0.112866 -0.267300 0.233336 0.040752 -0.001406 -0.179359 -0.235243 -0.086928 -0.128320 0.053616 0.131656 0.115445 0.076395 0.065649 0.084660 0.086051 0.094255 0.084057 0.111432 0.158334 0.073901 0.102307 0.096413 0.134169 0.149671
qa: -0.0636 -0.0830 -0.1806 -0.4161 0.6203 -0.3532 -0.3415 -0.0629 -0.1129 -0.2673 0.2333 0.0408 -0.0014 -0.1794 -0.2352 -0.0869 -0.1283 0.0536 0.1317 0.1154 0.0764 0.0656 0.0847 0.0861 0.0943 0.0841 0.1114 0.1583 0.0739 0.1023 0.0964 0.1342 0.1497
va: 1.2474 1.2174 2.3195 2.0498 5.4065 2.0924 2.0964 3.8435 3.8919 3.9678 3.7747 3.8686 3.9901 4.0372 3.9170 3.9864 4.0112 3.8854 1.0028 1.0293 1.0095 1.0244 1.0018 1.0002 1.0033 1.0062 0.9971 1.0051 1.0114 1.0101 1.0051 1.0128 1.0011
dispcorr: -0.018265088 hartree
energy: -2637.015983985405
dipole: 39.67190 -38.75343 0.91847 -12.54899 12.55931 0.01032 1.01299 -2.31648 -1.30348
magnitude: 1.59460 au
magnitude: 4.05316 debye
