program: Orca
programVersion: 5.0.2
elementType: Cl Cl S S P O O C C C C C C C C C C C H H H H H H H H H H H H H H H
charge: 0
multiplicity: 1
keywords: wb97x-d3
keywords: def2-TZVPP
keywords: def2/J RIJCOSX
keywords: DEFGRID2
keywords: scfconv7
keywords: smallprint printgap noloewdin
keywords: NOSOSCF
formula: C11H15Cl2O2PS2
InChI: InChI=1/C11H15Cl2O2PS2/c1-3-7-18-16(17,14-4-2)15-11-6-5-9(12)8-10(11)13/h5-6,8H,3-4,7H2,1-2H3
33 atoms
Cl -1.634749 -1.845061 -1.299588
Cl -5.411835 1.453355 0.647571
S  2.660936 -0.977188 -1.004749
S  0.8250 -0.421241 1.849373
P  1.358943 0.177481 0.105368
O  0.125765 0.426664 -0.934293
O  2.051963 1.61411 -0.001059
C  2.228495 -2.696484 -0.528542
C  3.428218 -3.417896 0.060186
C  3.873091 -2.877748 1.407065
C  -1.149254 0.677302 -0.510678
C  3.218183 1.934828 0.789561
C  -2.106358 -0.31766 -0.661919
C  -1.506497 1.902782 0.024139
C  3.344513 3.433157 0.859681
C  -3.427045 -0.086106 -0.314663
C  -2.82023 2.146922 0.386074
C  -3.76732 1.150585 0.2096
H  1.877498 -3.185086 -1.435838
H  1.399803 -2.667405 0.179664
H  3.143852 -4.468859 0.159974
H  4.257718 -3.396735 -0.650712
H  3.073203 -2.947457 2.144902
H  4.726497 -3.440967 1.784947
H  4.172404 -1.830779 1.342978
H  3.113081 1.506824 1.78891
H  4.093969 1.486171 0.317639
H  -0.759023 2.675616 0.147462
H  4.236972 3.686019 1.431691
H  3.446733 3.875485 -0.131116
H  2.486852 3.882776 1.35953
H  -4.170498 -0.859782 -0.447742
H  -3.095532 3.106012 0.801275
elementType: Cl S P O C H
totalener: -2636.99714657 hartree
nucrepener: 2116.75963088 hartree
electener: -4753.75677745 hartree
oneelecener: -7845.95694117 hartree
twoeener: 3092.20016373 hartree
cpcmener: -0.01737782 hartree
kineticenergy: 2631.03347280 hartree
xcener: -154.153264707263 hartree
chargesum: -0.0000000
charge: -0.064822 -0.083871 -0.157712 -0.419758 0.636123 -0.349259 -0.347217 -0.075624 -0.082580 -0.263367 0.206064 0.043733 0.013646 -0.158166 -0.244942 -0.103449 -0.132416 0.066096 0.128942 0.090186 0.075473 0.070350 0.078960 0.098554 0.068150 0.093368 0.100551 0.160805 0.091432 0.090210 0.088086 0.132920 0.149534
qa: -0.0648 -0.0839 -0.1577 -0.4198 0.6361 -0.3493 -0.3472 -0.0756 -0.0826 -0.2634 0.2061 0.0437 0.0136 -0.1582 -0.2449 -0.1034 -0.1324 0.0661 0.1289 0.0902 0.0755 0.0704 0.0790 0.0986 0.0682 0.0934 0.1006 0.1608 0.0914 0.0902 0.0881 0.1329 0.1495
va: 1.2479 1.2165 2.3141 2.0227 5.4030 2.1143 2.1149 3.8499 3.9043 3.9419 3.7826 3.8405 3.9969 4.0013 3.9628 4.0130 3.9917 3.8686 1.0106 1.0481 1.0088 1.0105 1.0033 1.0083 1.0099 1.0025 0.9953 0.9995 1.0062 1.0037 1.0053 1.0144 1.0011
dispcorr: -0.017601275 hartree
energy: -2637.014747840981
dipole: 38.59614 -37.21641 1.37973 -1.95197 2.20249 0.25052 8.33201 -8.43860 -0.10658
magnitude: 1.40633 au
magnitude: 3.57462 debye
