program: Gaussian 09
title: 000066504
version: EM64L-G09RevD.01
frameworkgroup: C1[X(C14H8ClNO2)]
method: RPBEPBE
basis: SDD
operation: Freq
keyword: #p
keyword: freq=noraman
keyword: PBEPBE/SDD
title: #p freq=noraman PBEPBE/SDD
converged: NO YES NO NO
title: Mulliken charges:
elementType: Cl O O N C C C C C C C C C C C C C C H H H H H H H H
charge: 0.000959 -0.176069 -0.211263 -0.671728 0.394321 0.248270 0.250593 0.283537 -0.177092 -0.222661 -0.529759 -0.396660 0.606536 -0.372937 -0.373799 -0.433088 -0.228439 -0.226932 0.292947 0.290968 0.290861 0.236439 0.239156 0.239255 0.321215 0.325372
chargesum: 0.00000
title: Mulliken charges with hydrogens summed into heavy atoms:
elementType: Cl O O N C C C C C C C C C C C C C C
charge: 0.000959 -0.176069 -0.211263 -0.025141 0.394321 0.248270 0.250593 0.283537 -0.177092 -0.222661 -0.529759 -0.103714 0.606536 -0.081969 -0.082938 -0.196649 0.010717 0.012323
polarizability: 3.07439088e+02 5.01092104e-01 2.02961041e+02 -5.93631550e-04 8.30429066e-03 6.41355860e+01
1716.lowfreq: -0.0029 -0.0027 -0.0026 5.5312 12.7053 14.1249 33.2433 55.8830 106.6031
frequency: 33.0504 55.8528 106.6015 124.2574 167.3021 171.3888 240.5964 263.1318 293.6469 305.2744 328.3794 338.4979 381.8683 414.9206 429.8675 441.7591 454.9413 463.2782 478.0808 493.3691 530.2841 572.8528 580.5332 639.5248 664.3800 679.2944 727.6845 738.9380 741.7330 746.3185 806.7719 842.8603 855.8819 872.4184 933.4583 938.1887 988.4139 994.8101 999.5299 1015.4811 1034.9064 1068.7000 1089.3422 1100.4989 1167.7487 1169.8395 1190.3759 1232.5803 1272.3526 1312.1573 1350.5780 1373.8935 1399.9328 1416.5032 1440.3989 1470.7985 1478.8573 1522.4353 1547.1097 1557.2589 1597.4529 1599.9276 1614.3843 1636.8507 3134.3867 3135.5016 3151.1953 3162.7559 3165.3219 3171.5559 3534.8661 3685.8067
redmass: 9.1039 8.8373 5.1668 5.1786 6.4081 7.9240 5.4745 8.2051 5.9009 5.1799 11.8624 7.1057 11.8565 3.4037 8.8769 2.9642 1.3175 6.5122 5.2626 4.1516 1.2433 3.6381 6.0619 6.9612 7.3519 3.9767 2.4999 8.1883 4.9342 7.5065 1.7257 1.8401 6.7102 2.2417 6.8480 1.9371 3.2040 1.3711 1.3983 1.3632 1.8788 2.1667 2.9836 2.2785 1.3561 1.1000 2.2622 2.2245 2.0913 2.4224 3.4973 5.0029 9.6990 8.2322 2.6200 2.7004 5.0494 8.0444 9.9605 6.2257 7.6731 3.9914 3.1210 1.8728 1.0895 1.0863 1.0903 1.0945 1.0956 1.1001 1.0462 1.1028
irintensity: 6.8742 2.9742 0.0434 0.1007 0.1127 3.0917 2.0036 1.2986 0.7731 8.8652 1.7317 1.6491 20.1531 0.3322 1.4225 31.4529 58.4731 0.6679 1.8965 3.9247 182.6984 11.7894 6.2861 11.4643 1.8929 0.9135 76.7433 25.6702 0.1586 22.5302 16.1397 55.8039 5.5018 6.2846 19.9025 0.1556 30.4719 0.0074 5.3827 0.0103 4.7701 11.9453 29.6357 48.8057 31.0984 12.8293 6.4710 41.7584 164.5390 269.6257 425.3776 0.4771 0.9278 20.4896 2.2554 19.4063 26.8129 134.0036 105.9334 112.7552 3.9951 11.5941 13.7248 398.4463 12.6715 4.3379 7.1127 1.6298 9.8134 29.6696 144.9357 47.5779
temp: 298.150 k
press: 1.00000 atm
elementType: 17 8 8 7 6 6 6 6 6 6 6 6 6 6 6 6 6 6 1 1 1 1 1 1 1 1
symmnumber: 1
zpe: 482344.5 jmol-1
zpe.correction: 0.183715 hartree
zpe.thermalcorrener: 0.197718 hartree
zpe.thermalcorrenthalpy: 0.198662 hartree
zpe.thermalcorrgfe: 0.142433 hartree
zpe.sumelectzpe: -1202.356081 hartree
zpe.sumelectthermal: -1202.342079 hartree
zpe.sumelectthermalent: -1202.341135 hartree
zpe.sumelectthermalfe: -1202.397364 hartree
dipole: -2.7924 0.8367 0.0044
dipole: 2.9151
quadrupole: -68.1411 -118.1028 -113.4421
quadrupole: -14.3692 -0.0037 -0.0050
quadrupole: 31.7542 -18.2075 -13.5468 -14.3692 -0.0037 -0.0050
hfenergy: -1202.5397966 hartree
pointgroup: C01 [X(C14H8Cl1N1O2)]
dipole: 1.1284538 -0.2047483 0.0017484 debye
dipolederiv: -0.2384798 -0.2395468 -0.0000415 -0.3702701 -0.5786638 -0.0001705 -0.0001322 -0.0002542 -0.023748 -0.6255458 0.0004091 0.0001484 0.0385584 -0.7889743 0.0008059 0.0001069 0.0002795 -0.2889054 -0.7913278 -0.0952309 -0.0000693 -0.3905779 -1.0240923 -0.0004178 0.0002516 0.0001739 -0.3182888 -1.7774575 -0.3604566 -0.0002775 -0.4852331 -0.2286266 -0.0001618 -0.0004594 -0.0001863 -0.6639463 -0.339302 0.4101769 -0.0000807 0.533391 -0.1589784 0.0001794 -0.0001848 -0.0000641 0.0806193 -1.2571055 -0.2556979 -0.0001976 -0.3520609 -0.2329562 -0.0000957 -0.000111 0.0000495 -0.0301355 -0.6142418 -0.146659 0.0002279 -0.285903 -0.0393562 0.0001646 0.0003349 -0.0000661 0.020166 -0.3546285 0.2522235 0.0000557 0.448842 -0.1848798 -0.0001587 0.0001105 -0.0000019 0.0263432 1.6666637 -0.0194208 -0.0002795 -0.2103977 0.8622853 -0.0010454 -0.0001461 -0.000241 0.1308468 2.0381697 0.081098 0.0000653 0.2437947 0.9764196 0.0004654 -0.0004122 -0.0000542 0.116267 -0.364921 -0.1123588 -0.0000089 0.9320339 0.9388689 0.0004057 -0.000184 0.0001666 -0.1162036 0.4024234 0.0221045 0.0000957 -0.0669052 0.1038809 0.0000132 0.0001036 -0.0000398 -0.0746019 1.78838 0.3651925 0.0005526 0.3853405 -0.1886151 0.0001169 0.0007371 0.000183 0.1675165 -0.1646249 0.1530186 -0.0000184 -0.0805347 0.0714014 0.000003 0.0001846 -0.0000917 -0.1078175 -0.1951613 -0.0789766 0.0000505 0.1547109 0.0944577 -0.0000502 0.000135 -0.0000005 -0.1108477 -0.2513756 -0.005194 0.0000534 -0.5955501 -0.0297185 -0.0001844 0.0000008 -0.0000092 -0.2105669 0.0975831 -0.1624067 -0.0001465 -0.0894643 0.0037788 0.0000634 -0.0001259 0.0001041 -0.1457735 0.2032842 0.1059916 -0.0002148 0.0491463 -0.0549264 -0.0000236 -0.0002435 -0.0000813 -0.1407014 0.1360741 -0.0620188 -0.0000135 0.0208221 0.016965 0.0000106 -0.0000096 0.0000066 0.1498877 0.1325226 -0.0549142 0.0000196 0.0183585 0.006352 -0.0000033 -0.0000516 0.0000455 0.1550123 0.1447548 0.0195773 0.0000312 -0.0563226 0.0012306 0.0000413 0.0000086 0.0000108 0.1560042 -0.0822874 0.0933653 -0.0000833 0.0684569 0.0156389 0.0000259 -0.0000879 0.0000633 0.167708 -0.0554933 0.0917495 0.0001004 0.1128076 0.0178814 -0.0000468 0.0001209 -0.0000634 0.1571492 -0.1137531 -0.0586284 0.0001435 -0.0700437 0.0712011 0.0000485 0.0001659 0.0000552 0.1566181 0.3123582 0.0229872 -0.0000564 -0.0316855 0.1127866 -0.000002 -0.0000542 0.0000053 0.3811547 0.3034917 0.0336158 -0.0000563 0.0786863 0.2166396 0.0000165 -0.0000582 0.0000103 0.3662434 unknown
polarizability: 306.0318327|12.0539608|204.3682958|0.0015149|-0.0081865|64.135586 unknown
InChI: InChI=1S/C14H8ClNO2/c15-12-10(16)6-5-9-11(12)14(18)8-4-2-1-3-7(8)13(9)17/h1-6H,16H2
charge 0 multiplicity 1
26 atoms
Cl 2.780055 2.550735 0.000537
O  -0.083455 2.58589 -0.00192
O  -0.89063 -2.877089 -0.000197
N  4.692237 0.308075 0.001205
C  0.936076 0.368672 -0.000504
C  0.67807 -1.046725 -0.000449
C  -1.612016 0.7411 -0.000383
C  -1.841519 -0.662418 -0.000107
C  -0.229785 1.324921 -0.001381
C  -0.695175 -1.61516 -0.000729
C  2.28716 0.792568 0.000123
C  1.75914 -1.96413 -0.000002
C  3.384544 -0.1320 0.000616
C  -2.717748 1.628636 0.00014
C  -3.16605 -1.163893 0.000679
C  3.083451 -1.527306 0.000477
C  -4.033637 1.125088 0.000981
C  -4.259425 -0.275398 0.001251
H  1.51299 -3.030286 -0.00004
H  -2.515331 2.704133 -0.000154
H  -3.304271 -2.249649 0.00081
H  3.91006 -2.246834 0.000819
H  -4.883335 1.816212 0.001417
H  -5.28315 -0.66487 0.001898
H  5.461252 -0.356137 0.001584
H  4.893092 1.306766 0.001329
