program: Orca
programVersion: 5.0.2
elementType: Cl Cl S S P O O C C C C C C C C C C C H H H H H H H H H H H H H H H
charge: 0
multiplicity: 1
keywords: wb97x-d3
keywords: def2-TZVPP
keywords: def2/J RIJCOSX
keywords: DEFGRID2
keywords: scfconv7
keywords: smallprint printgap noloewdin
keywords: NOSOSCF
formula: C11H15Cl2O2PS2
InChI: InChI=1/C11H15Cl2O2PS2/c1-3-7-18-16(17,14-4-2)15-11-6-5-9(12)8-10(11)13/h5-6,8H,3-4,7H2,1-2H3
33 atoms
Cl -0.641819 1.695799 -2.296988
Cl -5.089952 1.927756 0.693905
S  2.696922 -1.43687 -1.014023
S  1.169758 -0.994891 2.031805
P  1.32649 -0.469255 0.187597
O  -0.037953 -0.695359 -0.700054
O  1.707012 1.047677 -0.10854
C  2.483106 -3.179817 -0.466602
C  3.463492 -3.584871 0.616571
C  4.914026 -3.546799 0.168834
C  -1.21434 -0.083687 -0.34994
C  1.853734 2.063312 0.909823
C  -1.617868 1.060004 -1.030705
C  -2.024185 -0.612849 0.641923
C  0.537193 2.714215 1.246795
C  -2.81291 1.684629 -0.713752
C  -3.222903 -0.000473 0.968201
C  -3.599387 1.148966 0.292458
H  2.630501 -3.768467 -1.372924
H  1.448865 -3.327257 -0.157407
H  3.316473 -2.954382 1.494925
H  3.199302 -4.601856 0.919194
H  5.083122 -4.205356 -0.68479
H  5.222235 -2.54085 -0.120874
H  5.576332 -3.869293 0.972098
H  2.317022 1.628307 1.7961
H  2.55056 2.783463 0.485356
H  -1.723084 -1.516717 1.152922
H  0.079646 3.174724 0.371829
H  -0.167979 2.004501 1.681001
H  0.713449 3.499647 1.98269
H  -3.119125 2.574956 -1.245177
H  -3.85007 -0.420888 1.741768
elementType: Cl S P O C H
totalener: -2636.99458818 hartree
nucrepener: 2140.14915849 hartree
electener: -4777.14374667 hartree
oneelecener: -7892.48511545 hartree
twoeener: 3115.34136878 hartree
cpcmener: -0.01632934 hartree
kineticenergy: 2631.02009369 hartree
xcener: -154.152567482003 hartree
chargesum: 0.0000000
charge: -0.067403 -0.084195 -0.157261 -0.426636 0.636498 -0.348390 -0.350991 -0.100674 -0.101044 -0.253201 0.272908 0.044362 -0.023627 -0.194746 -0.243861 -0.085583 -0.123323 0.056754 0.129280 0.118358 0.063314 0.076700 0.085549 0.071213 0.092167 0.094312 0.112309 0.150886 0.084885 0.077288 0.112045 0.130908 0.151201
qa: -0.0674 -0.0842 -0.1573 -0.4266 0.6365 -0.3484 -0.3510 -0.1007 -0.1010 -0.2532 0.2729 0.0444 -0.0236 -0.1947 -0.2439 -0.0856 -0.1233 0.0568 0.1293 0.1184 0.0633 0.0767 0.0855 0.0712 0.0922 0.0943 0.1123 0.1509 0.0849 0.0773 0.1120 0.1309 0.1512
va: 1.2403 1.2165 2.3039 2.0157 5.3815 2.0798 2.1137 3.8670 3.8986 3.9244 3.7520 3.8377 3.9909 4.0165 3.9101 3.9881 3.9845 3.8823 1.0060 1.0243 1.0300 1.0088 1.0007 1.0165 1.0043 1.0143 0.9919 1.0067 1.0094 1.0107 1.0110 1.0160 1.0006
dispcorr: -0.018892781 hartree
energy: -2637.013480957598
dipole: 28.34634 -28.08974 0.25660 -15.25233 14.94239 -0.30994 10.24464 -9.95314 0.29150
magnitude: 0.49687 au
magnitude: 1.26295 debye
