program: Orca
programVersion: 5.0.2
elementType: Cl Cl S S P O O C C C C C C C C C C C H H H H H H H H H H H H H H H
charge: 0
multiplicity: 1
keywords: wb97x-d3
keywords: def2-TZVPP
keywords: def2/J RIJCOSX
keywords: DEFGRID2
keywords: scfconv7
keywords: smallprint printgap noloewdin
keywords: NOSOSCF
formula: C11H15Cl2O2PS2
InChI: InChI=1/C11H15Cl2O2PS2/c1-3-7-18-16(17,14-4-2)15-11-6-5-9(12)8-10(11)13/h5-6,8H,3-4,7H2,1-2H3
33 atoms
Cl -0.980772 2.824082 0.324472
Cl -5.04619 0.138908 -1.928823
S  1.22784 -2.170888 0.808575
S  2.553971 0.676585 2.158808
P  1.289418 -0.101264 0.943336
O  -0.244787 0.20742 1.429363
O  1.341244 0.381638 -0.575876
C  3.01135 -2.588917 0.857951
C  3.751067 -2.391998 -0.450062
C  3.219802 -3.236878 -1.593315
C  -1.338495 0.167615 0.603866
C  1.948872 1.624459 -1.009078
C  -1.803895 1.342918 0.024407
C  -2.031665 -1.013956 0.40132
C  3.314473 1.373322 -1.59197
C  -2.945373 1.342334 -0.759715
C  -3.175086 -1.031449 -0.379958
C  -3.61739 0.147428 -0.957109
H  3.017961 -3.638856 1.156087
H  3.460765 -2.017837 1.670173
H  3.75165 -1.336422 -0.725571
H  4.794986 -2.65261 -0.255979
H  2.195624 -2.967659 -1.85234
H  3.829011 -3.105705 -2.487494
H  3.231261 -4.297541 -1.337874
H  1.270441 2.033049 -1.755889
H  2.004078 2.329237 -0.179494
H  -1.697409 -1.926495 0.876869
H  4.008157 0.99467 -0.841873
H  3.274711 0.669868 -2.423517
H  3.712941 2.31537 -1.970102
H  -3.301217 2.261699 -1.203484
H  -3.712613 -1.957448 -0.526917
elementType: Cl S P O C H
totalener: -2636.99500184 hartree
nucrepener: 2141.74247534 hartree
electener: -4778.73747718 hartree
oneelecener: -7895.42729545 hartree
twoeener: 3116.68981827 hartree
cpcmener: -0.01860972 hartree
kineticenergy: 2631.01497624 hartree
xcener: -154.152100071603 hartree
chargesum: -0.0000000
charge: -0.068130 -0.081793 -0.174995 -0.416437 0.606359 -0.355416 -0.335840 -0.107888 -0.083500 -0.257665 0.194500 0.051426 0.025147 -0.152821 -0.264696 -0.093838 -0.138831 0.062585 0.131651 0.128998 0.055531 0.081831 0.072644 0.093786 0.087628 0.112898 0.094873 0.163753 0.081755 0.094551 0.109115 0.132997 0.149822
qa: -0.0681 -0.0818 -0.1750 -0.4164 0.6064 -0.3554 -0.3358 -0.1079 -0.0835 -0.2577 0.1945 0.0514 0.0251 -0.1528 -0.2647 -0.0938 -0.1388 0.0626 0.1317 0.1290 0.0555 0.0818 0.0726 0.0938 0.0876 0.1129 0.0949 0.1638 0.0818 0.0946 0.1091 0.1330 0.1498
va: 1.2451 1.2185 2.2942 2.0363 5.4136 2.1178 2.0523 3.8765 3.8784 3.9356 3.8536 3.7969 3.9480 4.0076 3.9636 4.0081 4.0126 3.8834 1.0007 1.0291 1.0155 1.0138 1.0142 1.0049 1.0012 0.9907 1.0090 0.9912 1.0075 1.0015 1.0083 1.0142 1.0018
dispcorr: -0.018697761 hartree
energy: -2637.013699597445
dipole: 34.86572 -34.30919 0.55652 -16.27263 15.34873 -0.92390 -10.21694 8.68100 -1.53594
magnitude: 1.87681 au
magnitude: 4.77047 debye
