program: Orca
programVersion: 5.0.2
elementType: Cl Cl S S P O O C C C C C C C C C C C H H H H H H H H H H H H H H H
charge: 0
multiplicity: 1
keywords: wb97x-d3
keywords: def2-TZVPP
keywords: def2/J RIJCOSX
keywords: DEFGRID2
keywords: scfconv7
keywords: smallprint printgap noloewdin
keywords: NOSOSCF
formula: C11H15Cl2O2PS2
InChI: InChI=1/C11H15Cl2O2PS2/c1-3-7-18-16(17,14-4-2)15-11-6-5-9(12)8-10(11)13/h5-6,8H,3-4,7H2,1-2H3
33 atoms
Cl -0.760153 1.195103 -2.435779
Cl -5.333052 1.13401 0.369795
S  3.047486 -0.871736 -0.516352
S  1.306884 -0.322065 2.37261
P  1.416351 -0.072203 0.469333
O  0.178142 -0.7107 -0.393675
O  1.376184 1.429704 -0.065327
C  3.360045 -2.3950 0.447278
C  2.341838 -3.499567 0.240197
C  2.221048 -3.966679 -1.199166
C  -1.105675 -0.267076 -0.192201
C  1.902971 2.550099 0.681313
C  -1.667988 0.638147 -1.085552
C  -1.860583 -0.749396 0.864284
C  3.407434 2.619489 0.629073
C  -2.974056 1.071033 -0.918495
C  -3.166852 -0.325875 1.043369
C  -3.70568 0.589142 0.153967
H  3.449744 -2.114394 1.495785
H  4.347981 -2.708593 0.105298
H  2.657518 -4.333135 0.873496
H  1.367204 -3.185951 0.620943
H  3.188966 -4.274402 -1.597761
H  1.546423 -4.819246 -1.273874
H  1.829019 -3.181504 -1.846282
H  1.455249 3.42368 0.211033
H  1.542818 2.498056 1.709885
H  -1.428861 -1.472646 1.541845
H  3.731737 3.539248 1.11675
H  3.876663 1.786028 1.151402
H  3.77303 2.639818 -0.397386
H  -3.407063 1.774338 -1.616149
H  -3.748962 -0.709218 1.869361
elementType: Cl S P O C H
totalener: -2636.99644024 hartree
nucrepener: 2141.25102475 hartree
electener: -4778.24746499 hartree
oneelecener: -7894.96891544 hartree
twoeener: 3116.72145045 hartree
cpcmener: -0.01591425 hartree
kineticenergy: 2631.02699967 hartree
xcener: -154.153162192810 hartree
chargesum: 0.0000000
charge: -0.066167 -0.084623 -0.149660 -0.424413 0.633593 -0.355166 -0.350585 -0.108397 -0.088420 -0.259797 0.273940 0.038253 -0.021740 -0.197783 -0.243013 -0.086305 -0.123598 0.051655 0.126105 0.131962 0.084463 0.053670 0.087274 0.094356 0.072396 0.105667 0.096210 0.154386 0.102652 0.078855 0.091516 0.131191 0.151522
qa: -0.0662 -0.0846 -0.1497 -0.4244 0.6336 -0.3552 -0.3506 -0.1084 -0.0884 -0.2598 0.2739 0.0383 -0.0217 -0.1978 -0.2430 -0.0863 -0.1236 0.0517 0.1261 0.1320 0.0845 0.0537 0.0873 0.0944 0.0724 0.1057 0.0962 0.1544 0.1027 0.0789 0.0915 0.1312 0.1515
va: 1.2432 1.2159 2.3077 2.0286 5.3830 2.0814 2.1280 3.8672 3.8692 3.9387 3.7671 3.8595 4.0225 4.0182 3.9004 3.9959 3.9846 3.8838 1.0295 1.0027 1.0082 1.0232 1.0008 1.0050 1.0142 0.9916 1.0133 1.0025 1.0107 1.0154 1.0041 1.0150 1.0007
dispcorr: -0.017941724 hartree
energy: -2637.014381965192
dipole: 29.44449 -28.58470 0.85978 -13.38912 13.15183 -0.23729 5.84769 -5.60859 0.23910
magnitude: 0.92342 au
magnitude: 2.34714 debye
