program: Orca
programVersion: 5.0.2
elementType: Cl Cl S S P O O C C C C C C C C C C C H H H H H H H H H H H H H H H
charge: 0
multiplicity: 1
keywords: wb97x-d3
keywords: def2-TZVPP
keywords: def2/J RIJCOSX
keywords: DEFGRID2
keywords: scfconv7
keywords: smallprint printgap noloewdin
keywords: NOSOSCF
formula: C11H15Cl2O2PS2
InChI: InChI=1/C11H15Cl2O2PS2/c1-3-7-18-16(17,14-4-2)15-11-6-5-9(12)8-10(11)13/h5-6,8H,3-4,7H2,1-2H3
33 atoms
Cl -1.597175 -0.952962 2.073382
Cl -5.018305 0.274672 -1.878961
S  1.15865 -1.291845 -0.340008
S  2.763553 0.760085 1.884254
P  1.487917 0.592652 0.463331
O  0.040414 1.1787 0.937237
O  1.718203 1.468517 -0.853526
C  1.633243 -2.387462 1.055445
C  3.071038 -2.859186 0.956963
C  3.330356 -3.776537 -0.224865
C  -1.118259 0.956538 0.236274
C  2.970285 1.414428 -1.575862
C  -2.000561 -0.018971 0.686589
C  -1.446181 1.719009 -0.872038
C  3.078342 2.649284 -2.429659
C  -3.205568 -0.235582 0.040019
C  -2.647111 1.512494 -1.530741
C  -3.513898 0.535713 -1.068802
H  0.934381 -3.223453 1.004782
H  1.443756 -1.861653 1.989322
H  3.734356 -1.992742 0.924677
H  3.30052 -3.387575 1.886712
H  3.099551 -3.29024 -1.174565
H  4.377106 -4.079003 -0.26146
H  2.725885 -4.68293 -0.159763
H  3.797308 1.360915 -0.864584
H  2.983644 0.508367 -2.184058
H  -0.773799 2.492652 -1.215652
H  2.266751 2.710987 -3.154348
H  3.08022 3.555032 -1.823923
H  4.017103 2.613568 -2.982386
H  -3.886155 -0.99579 0.397162
H  -2.897244 2.114517 -2.39278
elementType: Cl S P O C H
totalener: -2636.99758480 hartree
nucrepener: 2137.15745674 hartree
electener: -4774.15504154 hartree
oneelecener: -7886.34427733 hartree
twoeener: 3112.18923578 hartree
cpcmener: -0.01777546 hartree
kineticenergy: 2631.01490614 hartree
xcener: -154.151116061460 hartree
chargesum: -0.0000000
charge: -0.063880 -0.082362 -0.169288 -0.414941 0.619674 -0.342426 -0.338915 -0.077632 -0.096384 -0.252296 0.162128 0.039213 0.029009 -0.120522 -0.242751 -0.108119 -0.148065 0.074187 0.130080 0.107136 0.058842 0.076646 0.071973 0.092636 0.084469 0.095688 0.103089 0.159514 0.090029 0.088050 0.091855 0.133211 0.150154
qa: -0.0639 -0.0824 -0.1693 -0.4149 0.6197 -0.3424 -0.3389 -0.0776 -0.0964 -0.2523 0.1621 0.0392 0.0290 -0.1205 -0.2428 -0.1081 -0.1481 0.0742 0.1301 0.1071 0.0588 0.0766 0.0720 0.0926 0.0845 0.0957 0.1031 0.1595 0.0900 0.0880 0.0919 0.1332 0.1502
va: 1.2492 1.2179 2.2981 2.0431 5.4231 2.1260 2.1066 3.8211 3.9304 3.9336 3.8398 3.8402 3.9456 3.9712 3.9636 4.0292 4.0044 3.8705 1.0066 1.0374 1.0269 1.0087 1.0134 1.0044 1.0011 1.0037 0.9953 1.0019 1.0028 1.0062 1.0063 1.0148 1.0010
dispcorr: -0.017692359 hartree
energy: -2637.015277159549
dipole: 34.05305 -33.66570 0.38735 -7.38443 6.79390 -0.59053 -10.26888 8.63000 -1.63888
magnitude: 1.78457 au
magnitude: 4.53602 debye
