program: Orca
programVersion: 5.0.2
elementType: Cl Cl S S P O O C C C C C C C C C C C H H H H H H H H H H H H H H H
charge: 0
multiplicity: 1
keywords: wb97x-d3
keywords: def2-TZVPP
keywords: def2/J RIJCOSX
keywords: DEFGRID2
keywords: scfconv7
keywords: smallprint printgap noloewdin
keywords: NOSOSCF
formula: C11H15Cl2O2PS2
InChI: InChI=1/C11H15Cl2O2PS2/c1-3-7-18-16(17,14-4-2)15-11-6-5-9(12)8-10(11)13/h5-6,8H,3-4,7H2,1-2H3
33 atoms
Cl -1.048672 2.882224 -1.287937
Cl -5.566302 0.123605 -0.402108
S  1.369582 -1.803822 -0.637013
S  1.175978 -0.684227 2.585598
P  1.385698 -0.241269 0.732119
O  0.244186 0.71833 0.065996
O  2.677075 0.650411 0.487322
C  2.24237 -3.101497 0.314764
C  3.723839 -2.853221 0.525186
C  4.52136 -2.745767 -0.76174
C  -1.098926 0.508806 -0.004077
C  3.096718 1.150849 -0.808013
C  -1.844528 1.499154 -0.640327
C  -1.753016 -0.601476 0.50973
C  2.962139 2.650217 -0.848004
C  -3.218314 1.389178 -0.765911
C  -3.128255 -0.722869 0.387026
C  -3.850378 0.271584 -0.247684
H  2.081265 -4.002092 -0.280533
H  1.713426 -3.232773 1.258002
H  3.874033 -1.963517 1.140955
H  4.095033 -3.693246 1.118972
H  4.230573 -1.872444 -1.347293
H  5.586627 -2.656314 -0.549175
H  4.380809 -3.628305 -1.387992
H  4.135762 0.844637 -0.920476
H  2.524785 0.679819 -1.609485
H  -1.212075 -1.388772 1.014854
H  3.539242 3.124804 -0.054655
H  3.346692 3.013634 -1.801406
H  1.923372 2.966806 -0.763356
H  -3.779615 2.168618 -1.262045
H  -3.620048 -1.596018 0.791585
elementType: Cl S P O C H
totalener: -2636.99634125 hartree
nucrepener: 2116.78057824 hartree
electener: -4753.77691949 hartree
oneelecener: -7845.22422934 hartree
twoeener: 3091.44730985 hartree
cpcmener: -0.01802930 hartree
kineticenergy: 2631.00701475 hartree
xcener: -154.154106473553 hartree
chargesum: -0.0000000
charge: -0.069053 -0.086366 -0.174613 -0.416397 0.618328 -0.309417 -0.345033 -0.093307 -0.098866 -0.260393 0.300227 0.046056 -0.036990 -0.172952 -0.251215 -0.088403 -0.153163 0.048339 0.131966 0.125804 0.059448 0.085530 0.071231 0.096027 0.090031 0.111242 0.100399 0.125250 0.092740 0.095988 0.078785 0.130018 0.148758
qa: -0.0691 -0.0864 -0.1746 -0.4164 0.6183 -0.3094 -0.3450 -0.0933 -0.0989 -0.2604 0.3002 0.0461 -0.0370 -0.1730 -0.2512 -0.0884 -0.1532 0.0483 0.1320 0.1258 0.0594 0.0855 0.0712 0.0960 0.0900 0.1112 0.1004 0.1253 0.0927 0.0960 0.0788 0.1300 0.1488
va: 1.2433 1.2148 2.2788 2.0370 5.4242 2.1727 2.1063 3.8592 3.8789 3.9416 3.7258 3.8175 3.9897 3.9552 3.9636 3.9853 4.0595 3.8908 1.0028 1.0277 1.0264 1.0075 1.0072 1.0046 1.0016 0.9896 1.0021 1.0392 1.0053 1.0064 1.0179 1.0157 1.0024
dispcorr: -0.018210402 hartree
energy: -2637.014551649931
dipole: 38.71363 -37.49476 1.21888 -14.24323 13.21662 -1.02662 -2.83784 1.36013 -1.47771
magnitude: 2.17330 au
magnitude: 5.52408 debye
