program: Orca
programVersion: 5.0.2
elementType: Cl Cl S S P O O C C C C C C C C C C C H H H H H H H H H H H H H H H
charge: 0
multiplicity: 1
keywords: wb97x-d3
keywords: def2-TZVPP
keywords: def2/J RIJCOSX
keywords: DEFGRID2
keywords: scfconv7
keywords: smallprint printgap noloewdin
keywords: NOSOSCF
formula: C11H15Cl2O2PS2
InChI: InChI=1/C11H15Cl2O2PS2/c1-3-7-18-16(17,14-4-2)15-11-6-5-9(12)8-10(11)13/h5-6,8H,3-4,7H2,1-2H3
33 atoms
Cl -1.387956 0.501047 2.567786
Cl -4.941726 -0.098685 -1.40941
S  1.664663 -1.634254 -1.054275
S  3.322136 0.377511 1.20661
P  1.979831 0.215131 -0.155873
O  0.548659 0.718752 0.460809
O  2.174819 1.084838 -1.481367
C  2.409479 -2.810579 0.13989
C  1.411718 -3.482865 1.063136
C  0.659478 -2.530575 1.97466
C  -0.70123 0.526632 -0.041487
C  2.73672 2.419013 -1.454283
C  -1.736204 0.404568 0.88406
C  -0.998857 0.479873 -1.395914
C  1.862988 3.425778 -0.746782
C  -3.043756 0.216944 0.471635
C  -2.302953 0.283961 -1.820907
C  -3.313217 0.14911 -0.885132
H  3.184759 -2.281072 0.69503
H  2.906893 -3.54327 -0.494925
H  0.706927 -4.075686 0.476656
H  1.986662 -4.194717 1.662122
H  0.075159 -3.082194 2.710989
H  1.337986 -1.869319 2.515261
H  -0.03928 -1.914249 1.41057
H  3.728451 2.371039 -1.001757
H  2.856036 2.679169 -2.503621
H  -0.22808 0.612855 -2.142106
H  0.852069 3.442551 -1.154767
H  1.808679 3.247373 0.326852
H  2.296049 4.416121 -0.890102
H  -3.834077 0.122459 1.203357
H  -2.517793 0.244955 -2.879384
elementType: Cl S P O C H
totalener: -2636.99418248 hartree
nucrepener: 2162.54472411 hartree
electener: -4799.53890658 hartree
oneelecener: -7937.07425476 hartree
twoeener: 3137.53534818 hartree
cpcmener: -0.01773192 hartree
kineticenergy: 2631.00259147 hartree
xcener: -154.153095453404 hartree
chargesum: 0.0000000
charge: -0.070503 -0.085989 -0.154476 -0.411747 0.601294 -0.321856 -0.345238 -0.101553 -0.074655 -0.261197 0.253010 0.023407 0.000295 -0.177483 -0.245434 -0.089321 -0.145221 0.057854 0.117226 0.129523 0.070040 0.076500 0.102808 0.078924 0.052371 0.102354 0.111757 0.149545 0.091713 0.081405 0.106334 0.129094 0.149221
qa: -0.0705 -0.0860 -0.1545 -0.4117 0.6013 -0.3219 -0.3452 -0.1016 -0.0747 -0.2612 0.2530 0.0234 0.0003 -0.1775 -0.2454 -0.0893 -0.1452 0.0579 0.1172 0.1295 0.0700 0.0765 0.1028 0.0789 0.0524 0.1024 0.1118 0.1495 0.0917 0.0814 0.1063 0.1291 0.1492
va: 1.2413 1.2152 2.3019 2.0499 5.3843 2.0907 2.0907 3.8665 3.8772 3.9298 3.7649 3.8528 3.9474 3.9243 3.8944 4.0183 4.0320 3.8902 1.0389 1.0072 1.0119 1.0104 1.0111 1.0126 1.0072 1.0085 0.9916 1.0173 1.0035 1.0187 1.0092 1.0173 1.0025
dispcorr: -0.019794334 hartree
energy: -2637.013976808942
dipole: 20.22065 -20.18960 0.03105 -4.09339 3.95010 -0.14330 -1.58699 0.29382 -1.29317
magnitude: 1.30146 au
magnitude: 3.30804 debye
