program: Orca
programVersion: 5.0.2
elementType: Cl Cl S S P O O C C C C C C C C C C C H H H H H H H H H H H H H H H
charge: 0
multiplicity: 1
keywords: wb97x-d3
keywords: def2-TZVPP
keywords: def2/J RIJCOSX
keywords: DEFGRID2
keywords: scfconv7
keywords: smallprint printgap noloewdin
keywords: NOSOSCF
formula: C11H15Cl2O2PS2
InChI: InChI=1/C11H15Cl2O2PS2/c1-3-7-18-16(17,14-4-2)15-11-6-5-9(12)8-10(11)13/h5-6,8H,3-4,7H2,1-2H3
33 atoms
Cl -1.465199 2.931486 0.309127
Cl -5.434506 -0.681188 0.207212
S  1.846392 -1.480501 -0.97181
S  1.074245 0.441636 1.745429
P  1.342614 0.367023 -0.151991
O  0.073146 0.86102 -1.062595
O  2.373652 1.383652 -0.816156
C  1.619696 -2.640675 0.428899
C  2.855087 -2.794676 1.294293
C  4.059802 -3.345278 0.551854
C  -1.201031 0.4685 -0.750192
C  3.614873 1.754246 -0.177314
C  -2.044051 1.365583 -0.103318
C  -1.675825 -0.783707 -1.10498
C  4.641248 0.648675 -0.176684
C  -3.353342 1.020091 0.187376
C  -2.980184 -1.146811 -0.811932
C  -3.804554 -0.241514 -0.164397
H  1.357351 -3.584087 -0.05295
H  0.75445 -2.319042 1.006378
H  3.096693 -1.836529 1.758631
H  2.584985 -3.47114 2.110052
H  3.840274 -4.315526 0.10289
H  4.384029 -2.675482 -0.246295
H  4.904503 -3.477151 1.228053
H  3.967518 2.608157 -0.752279
H  3.404648 2.095761 0.837799
H  -1.029469 -1.477859 -1.624947
H  4.816429 0.258785 -1.178903
H  5.582323 1.056851 0.193009
H  4.362731 -0.178349 0.476497
H  -4.004782 1.725571 0.684096
H  -3.342362 -2.12588 -1.0922
elementType: Cl S P O C H
totalener: -2636.99414462 hartree
nucrepener: 2135.21239259 hartree
electener: -4772.20653721 hartree
oneelecener: -7882.77473055 hartree
twoeener: 3110.56819334 hartree
cpcmener: -0.01799672 hartree
kineticenergy: 2631.03011573 hartree
xcener: -154.156706918336 hartree
chargesum: -0.0000000
charge: -0.062076 -0.083549 -0.168232 -0.413319 0.635442 -0.355570 -0.350774 -0.081285 -0.114105 -0.257669 0.214773 0.036062 -0.001890 -0.175146 -0.241343 -0.087216 -0.129181 0.055508 0.133381 0.117832 0.061183 0.086686 0.091232 0.069365 0.095124 0.112534 0.097677 0.164132 0.092548 0.105784 0.072476 0.129946 0.149670
qa: -0.0621 -0.0835 -0.1682 -0.4133 0.6354 -0.3556 -0.3508 -0.0813 -0.1141 -0.2577 0.2148 0.0361 -0.0019 -0.1751 -0.2413 -0.0872 -0.1292 0.0555 0.1334 0.1178 0.0612 0.0867 0.0912 0.0694 0.0951 0.1125 0.0977 0.1641 0.0925 0.1058 0.0725 0.1299 0.1497
va: 1.2473 1.2170 2.2946 2.0363 5.3926 2.1067 2.1141 3.8172 3.9173 3.9262 3.8390 3.8564 3.9942 3.9872 3.8959 3.9991 4.0168 3.8822 1.0057 1.0326 1.0176 1.0093 1.0016 1.0109 1.0042 0.9908 1.0084 1.0014 1.0054 1.0124 0.9988 1.0157 1.0012
dispcorr: -0.018501499 hartree
energy: -2637.012646115473
dipole: 40.98748 -39.67888 1.30860 -20.13268 18.64982 -1.48285 2.57173 -2.82901 -0.25728
magnitude: 1.99436 au
magnitude: 5.06927 debye
