program: Orca
programVersion: 5.0.2
elementType: Cl Cl S S P O O C C C C C C C C C C C H H H H H H H H H H H H H H H
charge: 0
multiplicity: 1
keywords: wb97x-d3
keywords: def2-TZVPP
keywords: def2/J RIJCOSX
keywords: DEFGRID2
keywords: scfconv7
keywords: smallprint printgap noloewdin
keywords: NOSOSCF
formula: C11H15Cl2O2PS2
InChI: InChI=1/C11H15Cl2O2PS2/c1-3-7-18-16(17,14-4-2)15-11-6-5-9(12)8-10(11)13/h5-6,8H,3-4,7H2,1-2H3
33 atoms
Cl -1.028909 1.350806 -2.41408
Cl -5.328471 -0.915819 -0.122032
S  1.268849 -0.882041 -0.817741
S  1.508673 0.031462 2.461054
P  1.324662 0.603696 0.634968
O  -0.008639 1.494998 0.304228
O  2.342227 1.709148 0.104788
C  1.406247 -2.43095 0.149762
C  2.830672 -2.833483 0.476628
C  3.696028 -3.082787 -0.746352
C  -1.245299 0.912202 0.231061
C  3.714534 1.78418 0.545065
C  -1.852527 0.786919 -1.013472
C  -1.912312 0.485573 1.367304
C  4.59758 0.778928 -0.150629
C  -3.114379 0.229118 -1.130846
C  -3.173441 -0.078805 1.265185
C  -3.757961 -0.207168 0.016269
H  0.925491 -3.174128 -0.489189
H  0.795795 -2.328658 1.045497
H  3.285218 -2.078198 1.120741
H  2.767362 -3.747169 1.074489
H  4.693269 -3.412545 -0.455204
H  3.264981 -3.855225 -1.385829
H  3.814478 -2.180577 -1.348512
H  4.021104 2.801815 0.310548
H  3.755446 1.662571 1.629139
H  -1.452427 0.603999 2.338788
H  4.514988 0.854401 -1.234795
H  5.634338 0.978296 0.12145
H  4.37103 -0.244863 0.147467
H  -3.580398 0.133981 -2.101809
H  -3.688065 -0.411937 2.155494
elementType: Cl S P O C H
totalener: -2636.99507977 hartree
nucrepener: 2148.76422917 hartree
electener: -4785.75930894 hartree
oneelecener: -7909.77088704 hartree
twoeener: 3124.01157810 hartree
cpcmener: -0.01674958 hartree
kineticenergy: 2631.03074821 hartree
xcener: -154.157576484560 hartree
chargesum: 0.0000000
charge: -0.063702 -0.083671 -0.170776 -0.418429 0.631317 -0.349308 -0.349117 -0.071515 -0.120206 -0.259906 0.210942 0.043089 0.000459 -0.168819 -0.244637 -0.090158 -0.130651 0.058768 0.132255 0.117592 0.062185 0.088309 0.096485 0.092950 0.068992 0.111937 0.095790 0.157641 0.093297 0.104589 0.072649 0.131985 0.149664
qa: -0.0637 -0.0837 -0.1708 -0.4184 0.6313 -0.3493 -0.3491 -0.0715 -0.1202 -0.2599 0.2109 0.0431 0.0005 -0.1688 -0.2446 -0.0902 -0.1307 0.0588 0.1323 0.1176 0.0622 0.0883 0.0965 0.0929 0.0690 0.1119 0.0958 0.1576 0.0933 0.1046 0.0726 0.1320 0.1497
va: 1.2468 1.2168 2.3106 2.0333 5.4006 2.1149 2.1175 3.8227 3.9119 3.9234 3.8148 3.8457 3.9747 3.9987 3.9043 4.0025 4.0114 3.8796 1.0052 1.0337 1.0156 1.0098 1.0036 1.0018 1.0114 0.9912 1.0125 1.0044 1.0051 1.0128 0.9965 1.0148 1.0011
dispcorr: -0.018444776 hartree
energy: -2637.013524544375
dipole: 38.69072 -37.63192 1.05880 -14.54977 13.55107 -0.99870 5.41911 -5.38276 0.03635
magnitude: 1.45595 au
magnitude: 3.70072 debye
