program: Orca
programVersion: 5.0.2
elementType: Cl Cl S S P O O C C C C C C C C C C C H H H H H H H H H H H H H H H
charge: 0
multiplicity: 1
keywords: wb97x-d3
keywords: def2-TZVPP
keywords: def2/J RIJCOSX
keywords: DEFGRID2
keywords: scfconv7
keywords: smallprint printgap noloewdin
keywords: NOSOSCF
formula: C11H15Cl2O2PS2
InChI: InChI=1/C11H15Cl2O2PS2/c1-3-7-18-16(17,14-4-2)15-11-6-5-9(12)8-10(11)13/h5-6,8H,3-4,7H2,1-2H3
33 atoms
Cl -1.200815 0.518767 -2.688103
Cl -5.579508 0.05061 0.385313
S  1.306415 -1.238842 -1.097152
S  1.28136 -0.277585 2.170582
P  1.348262 0.260972 0.324693
O  0.129098 1.22854 -0.188294
O  2.568929 1.181754 -0.118206
C  2.219719 -2.566274 -0.23375
C  3.710394 -2.316335 -0.107484
C  4.40051 -3.497993 0.556435
C  -1.194492 0.922141 -0.023696
C  3.082956 2.227091 0.745286
C  -1.948639 0.575012 -1.139401
C  -1.806967 1.01465 1.215788
C  4.33682 1.76631 1.441825
C  -3.30258 0.305935 -1.022509
C  -3.158768 0.745727 1.348456
C  -3.891476 0.387272 0.228518
H  2.023086 -3.449614 -0.844487
H  1.748545 -2.728869 0.736049
H  4.135487 -2.137883 -1.096841
H  3.889838 -1.413518 0.480724
H  4.259768 -4.41539 -0.017107
H  5.472857 -3.323135 0.642978
H  4.011119 -3.670888 1.560836
H  3.28089 3.07194 0.087872
H  2.323818 2.537523 1.465052
H  -1.230384 1.313674 2.079644
H  4.74956 2.595391 2.017247
H  4.133426 0.947092 2.130338
H  5.094559 1.445763 0.727025
H  -3.882011 0.038464 -1.895327
H  -3.629599 0.820883 2.318421
elementType: Cl S P O C H
totalener: -2636.99692911 hartree
nucrepener: 2119.25545347 hartree
electener: -4756.25238258 hartree
oneelecener: -7850.94958071 hartree
twoeener: 3094.69719813 hartree
cpcmener: -0.01649736 hartree
kineticenergy: 2631.02985683 hartree
xcener: -154.154156886395 hartree
chargesum: -0.0000000
charge: -0.063512 -0.083642 -0.163215 -0.426031 0.640269 -0.363926 -0.346830 -0.089856 -0.072662 -0.269692 0.254036 0.055230 -0.026946 -0.182480 -0.252020 -0.085697 -0.124095 0.050820 0.132793 0.116528 0.071728 0.047716 0.087063 0.094115 0.083748 0.109798 0.092415 0.156036 0.105441 0.079223 0.091047 0.133533 0.149066
qa: -0.0635 -0.0836 -0.1632 -0.4260 0.6403 -0.3639 -0.3468 -0.0899 -0.0727 -0.2697 0.2540 0.0552 -0.0269 -0.1825 -0.2520 -0.0857 -0.1241 0.0508 0.1328 0.1165 0.0717 0.0477 0.0871 0.0941 0.0837 0.1098 0.0924 0.1560 0.1054 0.0792 0.0910 0.1335 0.1491
va: 1.2462 1.2170 2.3460 2.0110 5.3797 2.1102 2.0817 3.8698 3.8855 3.9553 3.7774 3.8395 4.0081 4.0195 3.9157 3.9889 3.9913 3.8858 1.0033 1.0294 1.0174 1.0217 1.0011 1.0036 1.0019 0.9962 1.0084 1.0067 1.0095 1.0146 1.0027 1.0136 1.0014
dispcorr: -0.017197906 hartree
energy: -2637.014127016888
dipole: 42.18741 -41.06759 1.11982 -8.90660 9.01728 0.11068 12.37712 -12.03544 0.34168
magnitude: 1.17601 au
magnitude: 2.98917 debye
