program: Orca
programVersion: 5.0.2
elementType: Cl Cl S S P O O C C C C C C C C C C C H H H H H H H H H H H H H H H
charge: 0
multiplicity: 1
keywords: wb97x-d3
keywords: def2-TZVPP
keywords: def2/J RIJCOSX
keywords: DEFGRID2
keywords: scfconv7
keywords: smallprint printgap noloewdin
keywords: NOSOSCF
formula: C11H15Cl2O2PS2
InChI: InChI=1/C11H15Cl2O2PS2/c1-3-7-18-16(17,14-4-2)15-11-6-5-9(12)8-10(11)13/h5-6,8H,3-4,7H2,1-2H3
33 atoms
Cl -1.004581 1.318694 -2.418108
Cl -5.344058 -0.884205 -0.138279
S  1.267605 -0.901894 -0.792121
S  1.475881 0.00815 2.483248
P  1.318516 0.588674 0.656883
O  -0.005911 1.484042 0.306749
O  2.346919 1.693983 0.146889
C  1.480674 -2.442306 0.173967
C  2.925201 -2.787936 0.474841
C  3.765867 -3.041145 -0.763657
C  -1.247074 0.910652 0.229513
C  3.72301 1.748053 0.578732
C  -1.845291 0.777851 -1.018533
C  -1.927229 0.501556 1.36446
C  4.609659 0.846918 -0.241812
C  -3.11127 0.230196 -1.14092
C  -3.192396 -0.052713 1.257429
C  -3.768117 -0.188297 0.005189
H  1.01723 -3.205209 -0.454568
H  0.88289 -2.359752 1.079981
H  3.370257 -2.001422 1.087567
H  2.909271 -3.686848 1.097479
H  4.785781 -3.31296 -0.491605
H  3.353924 -3.856359 -1.360708
H  3.823709 -2.158559 -1.402311
H  4.008528 2.791841 0.461121
H  3.78308 1.501858 1.640536
H  -1.474729 0.625653 2.338635
H  4.394678 -0.207629 -0.070988
H  4.517559 1.055171 -1.30744
H  5.646935 1.02187 0.045027
H  -3.570535 0.129367 -2.114541
H  -3.71696 -0.37218 2.146869
elementType: Cl S P O C H
totalener: -2636.99514484 hartree
nucrepener: 2146.73705847 hartree
electener: -4783.73220332 hartree
oneelecener: -7905.71139097 hartree
twoeener: 3121.97918766 hartree
cpcmener: -0.01681979 hartree
kineticenergy: 2631.03214087 hartree
xcener: -154.158015522893 hartree
chargesum: -0.0000000
charge: -0.063672 -0.083583 -0.173281 -0.419267 0.632917 -0.349499 -0.346844 -0.071377 -0.117737 -0.260884 0.213442 0.044221 -0.000701 -0.170625 -0.236200 -0.089473 -0.130562 0.058182 0.131237 0.119079 0.060285 0.088323 0.097122 0.093605 0.069164 0.111643 0.093527 0.157754 0.065084 0.093361 0.102890 0.132119 0.149750
qa: -0.0637 -0.0836 -0.1733 -0.4193 0.6329 -0.3495 -0.3468 -0.0714 -0.1177 -0.2609 0.2134 0.0442 -0.0007 -0.1706 -0.2362 -0.0895 -0.1306 0.0582 0.1312 0.1191 0.0603 0.0883 0.0971 0.0936 0.0692 0.1116 0.0935 0.1578 0.0651 0.0934 0.1029 0.1321 0.1497
va: 1.2470 1.2168 2.3117 2.0343 5.4024 2.1175 2.1200 3.8218 3.9092 3.9224 3.8136 3.8460 3.9756 4.0047 3.9109 4.0011 4.0110 3.8802 1.0052 1.0343 1.0164 1.0093 1.0034 1.0019 1.0111 0.9913 1.0139 1.0046 0.9966 1.0054 1.0129 1.0147 1.0011
dispcorr: -0.018341706 hartree
energy: -2637.013486548145
dipole: 39.18265 -38.07988 1.10277 -14.19395 13.20927 -0.98468 5.18049 -5.15188 0.02861
magnitude: 1.47868 au
magnitude: 3.75852 debye
