program: Orca
programVersion: 5.0.2
elementType: Cl Cl S S P O O C C C C C C C C C C C H H H H H H H H H H H H H H H
charge: 0
multiplicity: 1
keywords: wb97x-d3
keywords: def2-TZVPP
keywords: def2/J RIJCOSX
keywords: DEFGRID2
keywords: scfconv7
keywords: smallprint printgap noloewdin
keywords: NOSOSCF
formula: C11H15Cl2O2PS2
InChI: InChI=1/C11H15Cl2O2PS2/c1-3-7-18-16(17,14-4-2)15-11-6-5-9(12)8-10(11)13/h5-6,8H,3-4,7H2,1-2H3
33 atoms
Cl -1.567102 -1.96581 1.012627
Cl -5.082532 1.870937 -0.287427
S  3.093254 -1.083873 -0.538727
S  1.26936 0.504515 1.882471
P  1.542792 0.165478 0.012662
O  0.261807 -0.499221 -0.764961
O  1.782592 1.426107 -0.935425
C  3.27349 -2.167319 0.923716
C  2.200014 -3.228629 1.065114
C  2.121841 -4.194437 -0.103957
C  -0.979077 0.079487 -0.647861
C  2.638366 2.531948 -0.582374
C  -1.937528 -0.515429 0.165311
C  -1.305095 1.222183 -1.362193
C  1.98157 3.805371 -1.046437
C  -3.206464 0.02948 0.278444
C  -2.568425 1.778718 -1.257779
C  -3.504591 1.181249 -0.430342
H  3.330537 -1.528385 1.804705
H  4.256675 -2.620749 0.784241
H  2.428465 -3.78015 1.981274
H  1.231748 -2.75288 1.232222
H  1.861489 -3.685006 -1.032889
H  3.074657 -4.703942 -0.260016
H  1.363958 -4.957396 0.073822
H  2.802009 2.549781 0.496805
H  3.601249 2.376477 -1.069838
H  -0.577508 1.674887 -2.020922
H  2.63045 4.649192 -0.812695
H  1.814034 3.800517 -2.123618
H  1.027098 3.963623 -0.544173
H  -3.944884 -0.439208 0.914229
H  -2.811854 2.669197 -1.820076
elementType: Cl S P O C H
totalener: -2636.99797712 hartree
nucrepener: 2140.14853746 hartree
electener: -4777.14651457 hartree
oneelecener: -7892.82231143 hartree
twoeener: 3115.67579685 hartree
cpcmener: -0.01690261 hartree
kineticenergy: 2631.01743417 hartree
xcener: -154.151379799711 hartree
chargesum: 0.0000000
charge: -0.061716 -0.082957 -0.153854 -0.419461 0.631652 -0.347648 -0.352120 -0.111410 -0.083139 -0.260263 0.218064 0.043786 0.007325 -0.161065 -0.249341 -0.098219 -0.141223 0.062674 0.126398 0.131101 0.083699 0.042732 0.072531 0.088734 0.094329 0.087779 0.105006 0.165969 0.099865 0.092724 0.085885 0.132987 0.149178
qa: -0.0617 -0.0830 -0.1539 -0.4195 0.6317 -0.3476 -0.3521 -0.1114 -0.0831 -0.2603 0.2181 0.0438 0.0073 -0.1611 -0.2493 -0.0982 -0.1412 0.0627 0.1264 0.1311 0.0837 0.0427 0.0725 0.0887 0.0943 0.0878 0.1050 0.1660 0.0999 0.0927 0.0859 0.1330 0.1492
va: 1.2444 1.2177 2.3187 2.0328 5.3864 2.0869 2.1197 3.8710 3.8601 3.9383 3.8022 3.8413 3.9863 3.9928 3.9415 3.9964 4.0049 3.8779 1.0292 1.0033 1.0116 1.0405 1.0137 1.0016 1.0043 1.0106 0.9950 0.9992 1.0081 1.0032 1.0068 1.0142 1.0017
dispcorr: -0.018273403 hartree
energy: -2637.016250519972
dipole: 28.43301 -27.20531 1.22769 -2.64707 3.12749 0.48043 -3.40508 2.68722 -0.71786
magnitude: 1.50112 au
magnitude: 3.81555 debye
