program: Gaussian 09
title: 000066514
version: EM64L-G09RevD.01
frameworkgroup: C1[X(C13H16O4)]
method: RPBEPBE
basis: SDD
operation: Freq
keyword: #pfreq=noraman
keyword: PBEPBE/SDD
title: #p freq=noraman PBEPBE/SDD
converged: YES YES NO NO
title: Mulliken charges:
elementType: O O O O C C C C C C C C C C C C C H H H H H H H H H H H H H H H H
charge: -0.263971 -0.255777 -0.207593 -0.231259 -0.473977 0.478952 0.240756 0.259130 -0.340583 -0.428358 -0.235887 -0.228953 -0.241170 -0.224924 -0.225658 -0.673409 -0.673403 0.274299 0.261858 0.231423 0.226755 0.226207 0.228246 0.229499 0.233794 0.230456 0.232295 0.229177 0.212898 0.232392 0.212885 0.233055 0.230847
chargesum: 0.00000
title: Mulliken charges with hydrogens summed into heavy atoms:
elementType: O O O O C C C C C C C C C C C C C
charge: -0.263971 -0.255777 -0.207593 -0.231259 -0.199677 0.478952 0.240756 0.259130 -0.078726 -0.196935 -0.009133 -0.002746 -0.012924 0.238369 0.237092 0.001059 0.003384
polarizability: 1.83988784e+02 -1.27843430e+01 1.35605745e+02 -2.23570908e+00 -1.19023991e+01 1.33146917e+02
1716.lowfreq: -5.9588 -0.0011 -0.0009 -0.0005 4.1025 7.2335 19.1338 24.2166 38.8670
frequency: 18.9405 24.0172 38.8474 55.9292 63.4325 67.0669 75.8513 88.7110 138.0993 148.9831 185.7260 192.2477 235.5075 254.1939 257.4492 277.0702 313.6755 327.1832 371.6766 395.8040 404.5848 492.7913 564.6363 581.0951 616.8002 688.0958 698.2660 710.7185 762.7342 776.0051 799.0694 800.6866 806.4856 817.0490 850.1963 865.9186 914.8312 924.6495 962.5501 974.5172 991.1611 995.4216 1022.6957 1024.8229 1030.1138 1084.4858 1095.5440 1112.8307 1114.8703 1130.5623 1134.9755 1136.9702 1172.9674 1193.6157 1199.9783 1248.2689 1251.5032 1264.5686 1284.5009 1338.6676 1355.3049 1357.8923 1385.6316 1401.5320 1402.0370 1443.6057 1463.3209 1463.8426 1473.0782 1474.0228 1483.8072 1485.7584 1486.2280 1595.4448 1612.2979 1632.0494 1656.1552 2996.5778 2997.0223 3012.2186 3012.4728 3060.6040 3071.5410 3072.0880 3093.1183 3093.6255 3108.9140 3109.3400 3120.0853 3129.5279 3143.0556 3157.2447 3169.3933
redmass: 3.8418 4.2757 3.7253 2.5032 3.3599 3.9036 3.9541 4.4109 2.7094 3.0948 3.5878 2.9084 2.6128 1.5275 1.6319 5.1280 6.7380 6.0656 3.4432 3.8188 2.8452 3.5918 7.2937 7.5958 6.5560 5.9113 3.1009 1.9418 5.6337 2.6630 1.1406 1.1050 3.5676 4.1642 1.2485 4.6347 1.6791 4.6171 3.4114 1.4050 6.0899 1.3352 2.3649 2.5222 2.1911 1.6436 3.3551 2.3456 2.2431 2.9980 1.4645 1.5019 1.0581 1.1153 2.3718 1.1440 1.1379 1.8457 1.6436 1.2736 1.3871 1.3737 7.7347 1.2619 1.2653 2.1673 1.0399 1.0399 1.0648 1.0620 2.2691 1.0668 1.0678 6.1576 6.0518 9.2700 11.2327 1.0359 1.0359 1.0582 1.0582 1.0834 1.1067 1.1067 1.0985 1.0985 1.1028 1.1028 1.0862 1.0879 1.0929 1.0967 1.0998
irintensity: 0.7583 0.8362 0.1904 1.3335 0.5633 0.9811 0.5418 1.4694 1.2037 1.5523 7.7632 2.3112 1.8791 1.8410 1.9620 2.5081 5.3075 16.0059 5.0034 2.0526 0.6034 8.3397 11.3688 9.8786 1.8995 5.4936 12.6713 70.7429 6.0881 11.1674 5.2310 4.9812 2.8134 15.4140 0.0596 1.6275 2.9943 16.9607 6.8031 0.0639 1.1071 0.0461 46.5468 119.6174 5.6732 13.1660 363.8892 35.7969 28.5995 311.1055 4.8083 21.5677 1.5114 1.5609 40.2132 1.3958 2.1745 121.8697 112.6212 10.1533 2.3326 1.1435 1.2871 18.7573 25.9677 10.5395 11.8238 12.4607 4.1938 4.8025 17.9968 13.5077 14.0613 2.8255 8.9962 112.4697 198.9261 20.2164 21.0979 18.1455 16.5430 2.9104 5.9526 6.5469 30.0264 27.4180 42.0957 40.4848 4.3864 2.6316 30.2877 28.7834 8.8589
temp: 298.150 k
press: 1.00000 atm
elementType: 8 8 8 8 6 6 6 6 6 6 6 6 6 6 6 6 6 1 1 1 1 1 1 1 1 1 1 1 1 1 1 1 1
symmnumber: 1
zpe: 693172.9 jmol-1
zpe.correction: 0.264016 hartree
zpe.thermalcorrener: 0.282007 hartree
zpe.thermalcorrenthalpy: 0.282951 hartree
zpe.thermalcorrgfe: 0.214650 hartree
zpe.sumelectzpe: -804.608171 hartree
zpe.sumelectthermal: -804.590180 hartree
zpe.sumelectthermalent: -804.589236 hartree
zpe.sumelectthermalfe: -804.657537 hartree
dipole: -1.1496 2.2186 -1.9267
dipole: 3.1553
quadrupole: -82.9398 -93.9526 -100.0968
quadrupole: 2.4812 0.9810 1.5083
quadrupole: 9.3900 -1.6229 -7.7671 2.4812 0.9810 1.5083
hfenergy: -804.8721867 hartree
pointgroup: C01 [X(C13H16O4)]
dipole: -0.1516465 -0.8535885 0.8885216 debye
polarizability: 171.1661301|25.5311461|145.1062651|2.4949507|-12.1552378|136.4690509 unknown
InChI: InChI=1S/C13H16O4/c1-3-16-12(14)11(13(15)17-4-2)10-8-6-5-7-9-10/h5-9,11H,3-4H2,1-2H3
charge 0 multiplicity 1
33 atoms
O  -2.530393 0.227085 0.301044
O  0.381855 -2.174542 0.499356
O  -1.471934 1.870937 -0.965704
O  -0.285875 -1.442579 -1.611969
C  -0.144721 0.158944 0.286562
C  1.139571 0.955259 0.055382
C  -1.410561 0.87621 -0.217303
C  -0.0508 -1.212788 -0.405013
C  1.52991 1.342207 -1.251204
C  1.959399 1.299595 1.1572
C  2.724799 2.067638 -1.446512
C  3.154943 2.027189 0.960588
C  3.540443 2.413261 -0.343391
C  -3.859568 0.754682 -0.14493
C  0.603794 -3.548022 -0.060454
C  -4.922664 -0.111114 0.521633
C  1.091008 -4.41764 1.092769
H  -0.276328 -0.034263 1.364398
H  0.897743 1.080855 -2.105661
H  1.663628 0.998474 2.169629
H  3.01853 2.366525 -2.458879
H  3.780517 2.291114 1.820612
H  4.466517 2.97823 -0.498681
H  -3.925688 1.816732 0.152748
H  -3.895249 0.701034 -1.247859
H  -0.351057 -3.901634 -0.489199
H  1.342632 -3.468584 -0.878125
H  -4.850595 -0.049779 1.620967
H  -5.928114 0.234089 0.219087
H  -4.813709 -1.167554 0.222886
H  1.273775 -5.446475 0.732607
H  2.032494 -4.024329 1.512396
H  0.3400 -4.460455 1.899916
