program: Gaussian 09
title: 000066526
version: EM64L-G09RevD.01
frameworkgroup: C1[X(C16H24N2O2)]
method: RPBEPBE
basis: SDD
operation: Freq
keyword: #p
keyword: freq=noraman
keyword: PBEPBE/SDD
title: #p freq=noraman PBEPBE/SDD
converged: YES YES NO NO
title: Mulliken charges:
elementType: O O N N C C C C C C C C C C C C C C C C H H H H H H H H H H H H H H H H H H H H H H H H
charge: -0.285686 -0.285700 -0.110065 -0.110072 0.179721 0.179717 0.076290 0.076337 -0.350362 -0.347004 -0.350380 -0.347002 -0.372958 -0.372927 -0.661105 -0.664242 -0.661074 -0.664244 -0.240887 -0.240888 0.218878 0.272604 0.203888 0.251442 0.218896 0.272565 0.203884 0.251439 0.250706 0.250680 0.233887 0.210634 0.221193 0.255136 0.213259 0.212868 0.233865 0.210644 0.221197 0.255153 0.213260 0.212868 0.231792 0.231789
chargesum: 0.00000
title: Mulliken charges with hydrogens summed into heavy atoms:
elementType: O O N N C C C C C C C C C C C C C C C C
charge: -0.285686 -0.285700 -0.110065 -0.110072 0.179721 0.179717 0.076290 0.076337 0.141120 0.108326 0.141081 0.108321 -0.122251 -0.122247 0.004610 0.017021 0.004633 0.017038 -0.009094 -0.009100
polarizability: 2.05792088e+02 -2.97838336e-03 2.19895141e+02 -1.15039188e+00 -8.43201959e-04 1.49380024e+02
1716.lowfreq: -0.0004 0.0000 0.0006 2.9672 6.7578 7.8469 19.7182 33.4674 47.7169
frequency: 18.4216 33.1779 47.6772 47.9947 56.6054 67.7768 71.4987 79.3955 101.8551 102.4926 117.2775 139.5000 159.1230 191.0264 192.1973 202.5368 207.5008 216.5752 238.5926 284.8517 311.1701 316.8016 331.9345 339.2824 357.9869 363.1080 416.4205 416.6689 498.6039 512.1238 552.5757 567.6337 617.9259 620.4306 664.2453 704.9260 707.4187 729.5014 769.5433 770.4664 773.2728 774.5833 778.0595 779.1299 854.8274 870.2292 890.8746 942.0336 942.5283 957.1414 990.1039 1002.9700 1004.3459 1034.9829 1062.8730 1072.6305 1073.1116 1080.3922 1080.7324 1098.0047 1100.4781 1102.3842 1119.8279 1175.1886 1187.4671 1200.1548 1210.3300 1212.8548 1259.0370 1281.4479 1284.1189 1301.3336 1301.4302 1348.1813 1348.1910 1359.9712 1361.6506 1363.5023 1380.3962 1385.1528 1386.5816 1387.1565 1413.8458 1422.0669 1438.0478 1450.8284 1452.4549 1464.6314 1464.7560 1469.0816 1469.2390 1472.6855 1473.8806 1480.1089 1480.7483 1485.4090 1485.6990 1490.5091 1545.2438 1559.6337 1575.1586 1602.0314 2983.1962 2983.3151 2986.9652 2987.0024 3002.7285 3002.7815 3007.9625 3008.0656 3068.4103 3068.5804 3070.2412 3070.2734 3084.0942 3084.1788 3084.9937 3085.0070 3096.1309 3096.5303 3103.1335 3105.2472 3125.1706 3132.0136 3145.2329 3163.7299
redmass: 4.3770 3.7775 2.9861 3.4140 3.1079 4.2270 2.8095 3.1877 3.0185 2.7431 4.6920 2.7657 3.4006 1.5467 1.1065 1.1112 1.3397 3.3786 1.7945 3.5722 2.7523 2.6935 3.7021 2.5335 8.1116 3.2846 2.7029 2.5834 3.8503 3.4673 3.5004 3.4422 4.7218 4.0777 4.5136 10.3458 4.1937 6.2277 1.2231 1.6936 1.1996 1.2225 1.3339 2.3212 2.2952 2.7323 1.4639 2.0681 2.0745 1.4054 1.3200 2.9806 2.9685 2.4374 3.0447 2.1160 2.1136 1.8666 1.8417 1.9524 1.7747 1.7818 1.6859 1.0620 2.3687 2.5067 2.6986 2.4800 1.4650 1.4492 1.4357 1.3378 1.3525 1.2457 1.2443 2.1413 2.5426 1.2934 1.2129 1.2144 1.2163 1.2161 2.1670 2.4307 2.3720 1.1435 1.2096 1.0461 1.0476 1.0667 1.0735 1.0932 1.1601 1.8671 1.0588 1.2075 1.0847 1.1232 5.6827 5.7993 6.9029 6.2685 1.0355 1.0355 1.0355 1.0355 1.0664 1.0665 1.0628 1.0627 1.1007 1.1007 1.0980 1.0981 1.0994 1.0994 1.0972 1.0971 1.1006 1.1006 1.1019 1.1014 1.0851 1.0893 1.0945 1.1007
irintensity: 1.4941 5.8449 0.0388 0.0005 0.0090 4.4057 1.9718 0.3355 1.0477 1.4407 2.0106 1.2899 1.1542 0.0118 0.4083 0.0640 0.9655 0.1646 0.9464 5.7842 2.9530 1.0175 0.5254 6.1153 15.9197 8.5601 1.6135 11.1372 16.2922 2.6910 13.5908 2.7271 3.3907 2.0077 0.9947 5.8121 12.5195 6.1832 42.8122 3.1052 8.3340 35.0130 26.0244 0.9703 19.4534 17.4278 0.4068 14.2171 0.3437 4.4039 0.1114 2.9743 0.0710 10.2289 26.3676 4.6693 16.9312 0.4262 24.1808 8.3795 26.1109 12.6392 18.3285 0.0499 5.4722 10.2610 12.9085 21.6172 45.5602 71.7115 54.6089 5.4627 36.1779 1.5919 0.1581 1.8920 0.9178 9.0356 5.3789 10.4884 36.8957 32.3316 50.9491 84.8506 67.6678 1.1729 43.1055 0.0216 31.7999 6.8024 4.1162 3.1859 7.8699 6.3234 4.2548 15.7606 40.8691 1.8774 2.6817 530.9432 0.7346 1.4393 48.5270 6.5082 44.0500 3.8205 35.8580 11.6288 68.2644 6.7347 5.6016 4.1501 12.6432 5.5786 53.2023 28.7425 1.6042 64.5998 14.5031 48.2522 64.5365 5.0342 1.8085 3.0706 23.2515 28.1235
temp: 298.150 k
press: 1.00000 atm
elementType: 8 8 7 7 6 6 6 6 6 6 6 6 6 6 6 6 6 6 6 6 1 1 1 1 1 1 1 1 1 1 1 1 1 1 1 1 1 1 1 1 1 1 1 1
symmnumber: 1
zpe: 977980.4 jmol-1
zpe.correction: 0.372493 hartree
zpe.thermalcorrener: 0.395089 hartree
zpe.thermalcorrenthalpy: 0.396033 hartree
zpe.thermalcorrgfe: 0.318913 hartree
zpe.sumelectzpe: -882.541174 hartree
zpe.sumelectthermal: -882.518578 hartree
zpe.sumelectthermalent: -882.517633 hartree
zpe.sumelectthermalfe: -882.594754 hartree
dipole: -0.0016 0.7478 -0.0012
dipole: 0.7478
quadrupole: -100.7994 -108.7847 -133.5134
quadrupole: 0.0011 -1.4945 0.0005
quadrupole: 13.5665 5.5811 -19.1476 0.0011 -1.4945 0.0005
hfenergy: -882.9136669 hartree
pointgroup: C01 [X(C16H24N2O2)]
dipole: -0.0006636 0.2941978 -0.0004453 debye
polarizability: 205.7407453|-0.0039209|219.89514|-2.0535673|0.0052654|149.4313673 unknown
InChI: InChI=1S/C16H24N2O2/c1-5-17(6-2)15(19)13-11-9-10-12-14(13)16(20)18(7-3)8-4/h9-12H,5-8H2,1-4H3
charge 0 multiplicity 1
44 atoms
O  0.675137 -0.69677 1.973508
O  -0.67407 -0.696744 -1.972546
N  2.236422 -0.75608 0.240393
N  -2.235996 -0.756622 -0.240043
C  0.605028 1.113833 0.373972
C  -0.604993 1.113759 -0.372872
C  1.172768 -0.186142 0.910677
C  -1.172341 -0.18623 -0.90996
C  2.715664 -0.294204 -1.085887
C  2.831341 -1.997423 0.793993
C  -2.716024 -0.29496 1.086036
C  -2.830119 -1.99824 -0.793871
C  1.19548 2.345284 0.746762
C  -1.195631 2.34515 -0.74555
C  4.004244 0.550476 -1.008002
C  2.103437 -3.269499 0.308836
C  -4.005075 0.548956 1.007604
C  -2.101688 -3.269975 -0.308608
C  0.599107 3.570799 0.375521
C  -0.599525 3.57073 -0.374085
H  2.887554 -1.193859 -1.707366
H  1.905591 0.26765 -1.578499
H  3.897642 -2.020064 0.501655
H  2.772187 -1.935947 1.894142
H  -2.887657 -1.194688 1.707478
H  -1.906485 0.267358 1.578982
H  -3.896481 -2.021441 -0.501805
H  -2.770708 -1.936666 -1.894002
H  2.112549 2.340666 1.346825
H  -2.112648 2.340434 -1.345689
H  3.822198 1.493682 -0.463968
H  4.816653 0.00507 -0.49367
H  4.354127 0.802328 -2.025981
H  1.060466 -3.264213 0.666914
H  2.095971 -3.335767 -0.794286
H  2.604677 -4.171416 0.705614
H  -3.823356 1.49227 0.46365
H  -4.81695 0.003076 0.492927
H  -4.355538 0.800597 2.025436
H  -1.058629 -3.264122 -0.666419
H  -2.094483 -3.336306 0.794513
H  -2.602354 -4.172128 -0.705576
H  1.064596 4.517204 0.671443
H  -1.065186 4.517085 -0.669893
