program: Orca
programVersion: 5.0.2
elementType: Cl Cl S S P O O C C C C C C C C C C C H H H H H H H H H H H H H H H
charge: 0
multiplicity: 1
keywords: wb97x-d3
keywords: def2-TZVPP
keywords: def2/J RIJCOSX
keywords: DEFGRID2
keywords: scfconv7
keywords: smallprint printgap noloewdin
keywords: NOSOSCF
formula: C11H15Cl2O2PS2
InChI: InChI=1/C11H15Cl2O2PS2/c1-3-7-18-16(17,14-4-2)15-11-6-5-9(12)8-10(11)13/h5-6,8H,3-4,7H2,1-2H3
33 atoms
Cl -0.90206 2.758468 0.797199
Cl -5.265709 -0.276979 0.052359
S  1.969165 -1.64006 -1.167459
S  1.352647 -0.110347 1.830541
P  1.647099 0.076584 -0.057322
O  0.417847 0.758577 -0.901084
O  2.847448 1.010614 -0.525394
C  2.828406 -2.723909 0.037189
C  1.878801 -3.656629 0.762514
C  2.63474 -4.550867 1.733857
C  -0.896346 0.478782 -0.644931
C  3.136902 2.296117 0.074097
C  -1.644445 1.356159 0.132335
C  -1.50558 -0.633234 -1.202226
C  2.660179 3.418608 -0.810298
C  -2.993223 1.128839 0.351025
C  -2.852262 -0.874594 -0.990435
C  -3.582099 0.008592 -0.212196
H  3.398009 -2.103677 0.729541
H  3.549987 -3.281063 -0.561997
H  1.132447 -3.068735 1.299377
H  1.341591 -4.266928 0.033639
H  3.147101 -3.963119 2.497093
H  1.954651 -5.23299 2.243918
H  3.384969 -5.154689 1.220877
H  2.693335 2.354292 1.068951
H  4.218485 2.322255 0.190026
H  -0.931322 -1.309725 -1.820639
H  2.984018 4.366156 -0.37917
H  3.084379 3.346716 -1.810552
H  1.575168 3.442645 -0.890829
H  -3.570441 1.818842 0.950419
H  -3.320031 -1.742259 -1.433613
elementType: Cl S P O C H
totalener: -2636.99633953 hartree
nucrepener: 2126.24146352 hartree
electener: -4763.23780305 hartree
oneelecener: -7864.90098135 hartree
twoeener: 3101.66317830 hartree
cpcmener: -0.01647289 hartree
kineticenergy: 2631.02949926 hartree
xcener: -154.152922529962 hartree
chargesum: 0.0000000
charge: -0.061882 -0.082931 -0.157932 -0.420422 0.629401 -0.362776 -0.344919 -0.071342 -0.099971 -0.264726 0.228859 0.052460 0.015363 -0.179164 -0.236918 -0.092889 -0.128152 0.057402 0.106374 0.130059 0.062066 0.070903 0.082949 0.093767 0.084928 0.082056 0.112589 0.158415 0.097001 0.092485 0.067071 0.130697 0.149180
qa: -0.0619 -0.0829 -0.1579 -0.4204 0.6294 -0.3628 -0.3449 -0.0713 -0.1000 -0.2647 0.2289 0.0525 0.0154 -0.1792 -0.2369 -0.0929 -0.1282 0.0574 0.1064 0.1301 0.0621 0.0709 0.0829 0.0938 0.0849 0.0821 0.1126 0.1584 0.0970 0.0925 0.0671 0.1307 0.1492
va: 1.2470 1.2177 2.3073 2.0243 5.4033 2.0860 2.1126 3.8252 3.8940 3.9498 3.7820 3.8354 3.9959 4.0307 3.9381 3.9951 4.0135 3.8802 1.0284 1.0084 1.0288 1.0136 1.0021 1.0041 1.0014 1.0168 0.9917 0.9994 1.0073 1.0063 1.0248 1.0144 1.0014
dispcorr: -0.017651000 hartree
energy: -2637.013990532863
dipole: 29.51678 -28.59315 0.92362 -15.17191 14.64915 -0.52276 1.36756 -1.98774 -0.62018
magnitude: 1.22922 au
magnitude: 3.12442 debye
