program: Gaussian 09
title: 000066498
version: EM64L-G09RevD.01
frameworkgroup: C1[X(C17H8Br2O)]
method: RPBEPBE
basis: SDD
operation: Freq
keyword: #p
keyword: freq=noraman
keyword: PBEPBE/SDD
title: #p freq=noraman PBEPBE/SDD
converged: NO YES NO NO
title: Mulliken charges:
elementType: Br Br O C C C C C C C C C C C C C C C C C H H H H H H H H
charge: 0.037711 0.025026 -0.183316 0.045539 0.404564 0.304952 0.294080 0.191232 0.621121 -0.420262 -0.445780 -0.428198 -0.513880 -0.425238 -0.353773 -0.333873 -0.225446 -0.245147 -0.203012 -0.237252 0.236980 0.299735 0.230498 0.257979 0.311159 0.254010 0.245395 0.255194
chargesum: 0.00000
title: Mulliken charges with hydrogens summed into heavy atoms:
elementType: Br Br O C C C C C C C C C C C C C C C C C
charge: 0.037711 0.025026 -0.183316 0.045539 0.404564 0.304952 0.294080 0.191232 0.621121 -0.420262 -0.208800 -0.128463 -0.513880 -0.167259 -0.123275 -0.022714 0.028564 0.000248 0.052183 -0.237252
polarizability: 4.32220282e+02 3.06224554e-01 2.41913464e+02 -5.30205603e-03 3.19699055e-03 7.46542544e+01
1716.lowfreq: -3.9294 -3.6836 -0.0004 -0.0001 0.0004 8.4410 32.3076 52.1593 80.1675
frequency: 32.2872 52.1567 80.1666 95.3155 145.8870 161.7518 171.4759 174.9153 188.9747 253.4847 268.7140 309.3943 347.8075 350.0833 390.4416 419.1040 449.4293 453.9107 466.8821 468.0428 535.2077 539.7668 556.7184 612.5137 619.0205 638.8611 656.0829 679.3897 713.4384 779.6743 787.0423 791.3864 813.0498 832.8406 845.2980 884.8735 916.3221 934.8550 954.8845 961.7294 970.2863 983.0901 1014.5064 1037.0735 1062.7047 1082.1941 1099.3946 1132.3710 1177.1839 1187.3907 1198.8546 1218.7221 1255.5476 1278.2799 1310.3404 1342.9326 1374.1723 1383.2440 1388.6504 1412.0053 1422.6874 1448.8603 1473.0122 1510.9650 1533.9514 1562.5114 1572.2307 1584.8823 1599.8739 1618.3812 3144.4706 3149.1728 3157.6838 3158.3547 3164.7786 3171.9695 3173.9900 3177.7382
redmass: 11.8761 6.8995 6.1890 16.6478 6.0611 16.2366 16.8839 4.5316 5.1177 5.4123 13.4878 5.8527 4.7276 8.1317 7.9850 4.6404 3.7936 6.3653 8.0449 3.4345 6.9625 3.9777 7.9249 6.0688 4.9665 3.1416 7.4898 8.7331 3.4428 2.6058 5.4390 7.5364 1.7968 1.3505 1.7126 6.4721 1.9647 7.2894 1.5274 1.5733 1.3700 1.9743 1.4646 4.2607 3.0533 1.9711 2.9646 1.7597 1.4594 1.9663 1.5149 1.5864 1.4813 2.9308 2.0332 3.2625 3.4180 4.3016 7.5501 4.3859 5.1082 2.4333 2.9739 5.4595 8.2414 7.4801 7.1751 5.6646 7.5797 7.7019 1.0868 1.0886 1.0917 1.0872 1.0926 1.0992 1.0966 1.0957
irintensity: 0.0023 3.1593 0.0901 0.0207 0.1831 0.1942 0.4002 1.8721 3.1303 0.5207 9.0812 0.1099 0.8981 9.3119 13.5459 2.3772 11.1229 5.2057 7.7942 0.0020 5.0001 6.8464 1.5922 1.5677 0.0918 8.0426 4.7785 75.9689 1.9179 4.1151 1.0999 5.5034 22.1690 114.9428 1.7570 12.4877 0.0102 47.0385 7.3136 0.2239 0.3217 6.8172 3.4596 55.6087 0.1693 34.7931 23.3544 16.0596 1.5847 17.5155 14.9548 15.1786 22.1061 124.4979 19.7683 101.6313 39.0711 35.8610 7.3528 10.5917 16.6595 93.1937 20.3051 21.9502 192.3183 56.1968 55.0925 6.4002 14.6217 16.7338 3.3887 6.2753 0.3773 2.7417 4.6710 16.0332 3.9945 10.8733
temp: 298.150 k
press: 1.00000 atm
elementType: 35 35 8 6 6 6 6 6 6 6 6 6 6 6 6 6 6 6 6 6 1 1 1 1 1 1 1 1
symmnumber: 1
zpe: 507621.2 jmol-1
zpe.correction: 0.193343 hartree
zpe.thermalcorrener: 0.208688 hartree
zpe.thermalcorrenthalpy: 0.209632 hartree
zpe.thermalcorrgfe: 0.148622 hartree
zpe.sumelectzpe: -753.467301 hartree
zpe.sumelectthermal: -753.451956 hartree
zpe.sumelectthermalent: -753.451012 hartree
zpe.sumelectthermalfe: -753.512021 hartree
dipole: -2.7848 -2.8584 0.0003
dipole: 3.9907
quadrupole: -137.0407 -122.8538 -137.9332
quadrupole: -12.0036 0.0010 0.0014
quadrupole: -4.4314 9.7554 -5.3240 -12.0036 0.0010 0.0014
hfenergy: -753.6606438 hartree
pointgroup: C01 [X(C17H8Br2O1)]
dipole: -0.982977 1.2242792 -0.0001157 debye
polarizability: 430.4192768|-18.4280678|243.7144686|0.0055837|0.0026749|74.6542544 unknown
InChI: InChI=1S/C17H8Br2O/c18-9-4-5-10-11-6-7-15(19)12-2-1-3-13(16(11)12)17(20)14(10)8-9/h1-8H
charge 0 multiplicity 1
28 atoms
Br -5.058383 1.672991 0.000023
Br 5.934898 0.101434 0.000272
O  1.346037 -2.899385 0.000093
C  -1.155286 -0.153203 -0.000111
C  -0.28565 0.998641 -0.000078
C  1.180092 0.806699 -0.000069
C  -0.617484 -1.48836 -0.000157
C  1.730706 -0.513424 -0.000132
C  -2.600009 0.009184 -0.00003
C  0.855863 -1.722421 -0.000425
C  -0.872307 2.277523 -0.000029
C  -1.470558 -2.60576 -0.000069
C  -3.122285 1.348183 0.000004
C  -3.432666 -1.155312 0.000033
C  2.093357 1.89893 0.000068
C  3.133821 -0.722549 -0.000036
C  -2.280489 2.459721 -0.000004
C  -2.878815 -2.439908 0.000026
C  3.485353 1.700059 0.00016
C  3.99544 0.380056 0.000118
H  -0.249767 3.1764 0.000015
H  -1.011789 -3.59986 -0.000124
H  1.727777 2.929614 0.000105
H  -4.518882 -1.023595 0.000095
H  3.498739 -1.753721 -0.000126
H  -2.698488 3.469595 0.000028
H  -3.53313 -3.317269 0.000091
H  4.165402 2.556638 0.00026
