program: Orca
programVersion: 5.0.2
elementType: Cl Cl S S P O O C C C C C C C C C C C H H H H H H H H H H H H H H H
charge: 0
multiplicity: 1
keywords: wb97x-d3
keywords: def2-TZVPP
keywords: def2/J RIJCOSX
keywords: DEFGRID2
keywords: scfconv7
keywords: smallprint printgap noloewdin
keywords: NOSOSCF
formula: C11H15Cl2O2PS2
InChI: InChI=1/C11H15Cl2O2PS2/c1-3-7-18-16(17,14-4-2)15-11-6-5-9(12)8-10(11)13/h5-6,8H,3-4,7H2,1-2H3
33 atoms
Cl -0.966087 2.775113 0.164261
Cl -5.038209 -0.71935 0.328075
S  2.565053 -1.601548 -0.660702
S  1.374567 0.39983 1.830317
P  1.788926 0.22035 -0.036734
O  0.515911 0.531991 -1.030739
O  2.87084 1.165461 -0.718766
C  2.309843 -2.678821 0.79557
C  0.918031 -3.269059 0.906496
C  0.554957 -4.204925 -0.233413
C  -0.769021 0.223828 -0.690057
C  2.696709 2.585874 -0.948744
C  -1.585843 1.194868 -0.12101
C  -1.282825 -1.034499 -0.955002
C  2.955132 3.40614 0.290019
C  -2.905211 0.911534 0.19056
C  -2.598214 -1.335311 -0.643494
C  -3.3943 -0.358933 -0.067357
H  2.583644 -2.110459 1.68427
H  3.059962 -3.461652 0.666642
H  0.882113 -3.815953 1.852417
H  0.185716 -2.463358 0.994885
H  -0.454494 -4.596471 -0.108563
H  0.592579 -3.70396 -1.202555
H  1.238106 -5.055592 -0.276658
H  3.42024 2.822609 -1.725818
H  1.704046 2.781153 -1.354104
H  -0.654132 -1.780366 -1.423426
H  2.940363 4.46044 0.013851
H  2.196675 3.250446 1.054887
H  3.933935 3.187888 0.717119
H  -3.536721 1.672229 0.628346
H  -2.990778 -2.32095 -0.851626
elementType: Cl S P O C H
totalener: -2636.99494208 hartree
nucrepener: 2168.36088540 hartree
electener: -4805.35582748 hartree
oneelecener: -7948.82240569 hartree
twoeener: 3143.46657821 hartree
cpcmener: -0.01693483 hartree
kineticenergy: 2631.01763470 hartree
xcener: -154.155176539553 hartree
chargesum: 0.0000000
charge: -0.063008 -0.084129 -0.160643 -0.411764 0.622933 -0.361565 -0.346126 -0.091729 -0.114301 -0.269899 0.226397 0.017742 0.032779 -0.182510 -0.236082 -0.112804 -0.146105 0.078459 0.124806 0.130778 0.089123 0.057859 0.098932 0.070753 0.095508 0.113824 0.100601 0.176552 0.099901 0.069907 0.093874 0.131724 0.148213
qa: -0.0630 -0.0841 -0.1606 -0.4118 0.6229 -0.3616 -0.3461 -0.0917 -0.1143 -0.2699 0.2264 0.0177 0.0328 -0.1825 -0.2361 -0.1128 -0.1461 0.0785 0.1248 0.1308 0.0891 0.0579 0.0989 0.0708 0.0955 0.1138 0.1006 0.1766 0.0999 0.0699 0.0939 0.1317 0.1482
va: 1.2455 1.2167 2.3127 2.0289 5.3813 2.0676 2.1374 3.8266 3.8922 3.9276 3.7653 3.8610 3.9854 3.9631 3.8983 4.0179 4.0273 3.8725 1.0349 1.0056 1.0081 1.0225 1.0027 1.0117 1.0033 0.9916 1.0086 0.9759 1.0092 1.0228 1.0056 1.0148 1.0038
dispcorr: -0.019817440 hartree
energy: -2637.014759518140
dipole: 20.53375 -20.32078 0.21297 -13.41326 12.73597 -0.67728 -0.32522 -0.40968 -0.73490
magnitude: 1.02183 au
magnitude: 2.59730 debye
