program: Orca
programVersion: 5.0.2
elementType: Cl Cl S S P O O C C C C C C C C C C C H H H H H H H H H H H H H H H
charge: 0
multiplicity: 1
keywords: wb97x-d3
keywords: def2-TZVPP
keywords: def2/J RIJCOSX
keywords: DEFGRID2
keywords: scfconv7
keywords: smallprint printgap noloewdin
keywords: NOSOSCF
formula: C11H15Cl2O2PS2
InChI: InChI=1/C11H15Cl2O2PS2/c1-3-7-18-16(17,14-4-2)15-11-6-5-9(12)8-10(11)13/h5-6,8H,3-4,7H2,1-2H3
33 atoms
Cl -0.869953 1.726008 -2.256713
Cl -5.463521 1.717633 0.519138
S  2.457284 -1.363601 -1.078402
S  0.914519 -1.299219 1.983611
P  1.049579 -0.562215 0.213072
O  -0.279776 -0.711047 -0.72927
O  1.256261 1.015261 0.116699
C  2.953256 -2.913677 -0.231798
C  4.080728 -2.726222 0.764967
C  5.378742 -2.241834 0.14206
C  -1.473765 -0.128111 -0.390884
C  2.013159 1.778143 1.0753
C  -1.879728 1.026772 -1.051332
C  -2.307698 -0.710264 0.549776
C  3.502973 1.606994 0.905969
C  -3.110953 1.599324 -0.776429
C  -3.539707 -0.146568 0.837263
C  -3.925994 1.007029 0.174316
H  3.255555 -3.572074 -1.047854
H  2.070622 -3.353337 0.229595
H  3.759101 -2.046239 1.555555
H  4.242654 -3.697211 1.241681
H  5.26674 -1.255914 -0.312034
H  6.163488 -2.166747 0.894839
H  5.727624 -2.927901 -0.631978
H  1.717496 2.810537 0.898202
H  1.697116 1.50641 2.084177
H  -2.002657 -1.621617 1.045419
H  4.011735 2.302868 1.573337
H  3.835214 0.600533 1.162713
H  3.819766 1.828424 -0.112962
H  -3.42382 2.493028 -1.298331
H  -4.187013 -0.609672 1.568764
elementType: Cl S P O C H
totalener: -2636.99465022 hartree
nucrepener: 2119.49811742 hartree
electener: -4756.49276764 hartree
oneelecener: -7851.40748339 hartree
twoeener: 3094.91471575 hartree
cpcmener: -0.01585724 hartree
kineticenergy: 2631.02351346 hartree
xcener: -154.153034501037 hartree
chargesum: 0.0000000
charge: -0.067148 -0.084119 -0.160641 -0.421763 0.639840 -0.356144 -0.336540 -0.083508 -0.117451 -0.255669 0.248397 0.037642 -0.012123 -0.188974 -0.236773 -0.089967 -0.128716 0.053871 0.131031 0.119732 0.063314 0.085002 0.069617 0.094376 0.089815 0.106823 0.094892 0.156209 0.103293 0.071228 0.092244 0.131528 0.150681
qa: -0.0671 -0.0841 -0.1606 -0.4218 0.6398 -0.3561 -0.3365 -0.0835 -0.1175 -0.2557 0.2484 0.0376 -0.0121 -0.1890 -0.2368 -0.0900 -0.1287 0.0539 0.1310 0.1197 0.0633 0.0850 0.0696 0.0944 0.0898 0.1068 0.0949 0.1562 0.1033 0.0712 0.0922 0.1315 0.1507
va: 1.2422 1.2166 2.2936 2.0299 5.3739 2.1242 2.1206 3.8218 3.9040 3.9267 3.8111 3.8599 4.0048 4.0096 3.9117 3.9974 3.9966 3.8848 1.0064 1.0330 1.0201 1.0090 1.0126 1.0040 1.0015 0.9912 1.0118 1.0060 1.0133 1.0016 1.0042 1.0150 1.0009
dispcorr: -0.017874683 hartree
energy: -2637.012524901687
dipole: 41.56712 -40.37898 1.18814 -12.90983 12.65581 -0.25403 10.49679 -10.06834 0.42845
magnitude: 1.28833 au
magnitude: 3.27466 debye
