program: Orca
programVersion: 5.0.2
elementType: Cl Cl S S P O O C C C C C C C C C C C H H H H H H H H H H H H H H H
charge: 0
multiplicity: 1
keywords: wb97x-d3
keywords: def2-TZVPP
keywords: def2/J RIJCOSX
keywords: DEFGRID2
keywords: scfconv7
keywords: smallprint printgap noloewdin
keywords: NOSOSCF
formula: C11H15Cl2O2PS2
InChI: InChI=1/C11H15Cl2O2PS2/c1-3-7-18-16(17,14-4-2)15-11-6-5-9(12)8-10(11)13/h5-6,8H,3-4,7H2,1-2H3
33 atoms
Cl -0.383525 1.251282 -2.243148
Cl -4.712974 -1.393637 -0.492555
S  2.151366 -0.687491 -0.509149
S  1.661566 -0.154764 2.809175
P  1.693509 0.616678 1.051202
O  0.317859 1.394333 0.602874
O  2.717382 1.82358 0.935451
C  1.86291 -2.340836 0.220161
C  0.413658 -2.785564 0.211371
C  -0.17546 -2.926013 -1.181668
C  -0.851614 0.731272 0.363284
C  2.751331 2.877444 -0.057468
C  -1.299792 0.589723 -0.945584
C  -1.620424 0.240175 1.406832
C  3.248258 2.415671 -1.404121
C  -2.492449 -0.060651 -1.217258
C  -2.813089 -0.413807 1.150355
C  -3.231203 -0.567169 -0.161316
H  2.287659 -2.34445 1.223255
H  2.477526 -2.998495 -0.398182
H  0.37801 -3.751157 0.72294
H  -0.185962 -2.101184 0.814172
H  -1.22483 -3.217401 -1.133651
H  -0.119579 -1.990652 -1.740118
H  0.354791 -3.687158 -1.756906
H  1.768729 3.342252 -0.133782
H  3.43365 3.611378 0.366492
H  -1.288903 0.374972 2.426956
H  3.388352 3.29482 -2.033688
H  4.207369 1.904514 -1.328083
H  2.539736 1.764093 -1.914321
H  -2.83042 -0.171137 -2.238273
H  -3.404862 -0.7965 1.96978
elementType: Cl S P O C H
totalener: -2636.99427655 hartree
nucrepener: 2211.60779367 hartree
electener: -4848.60207022 hartree
oneelecener: -8034.91697312 hartree
twoeener: 3186.31490291 hartree
cpcmener: -0.01710701 hartree
kineticenergy: 2631.01222861 hartree
xcener: -154.157546472976 hartree
chargesum: 0.0000000
charge: -0.066009 -0.084786 -0.175659 -0.419568 0.617971 -0.347691 -0.353846 -0.091697 -0.072816 -0.285378 0.216029 0.036914 0.025995 -0.155203 -0.251775 -0.117120 -0.133278 0.082271 0.125971 0.129181 0.088711 0.043935 0.094522 0.070431 0.103343 0.102417 0.112631 0.151061 0.105901 0.099258 0.068747 0.130630 0.148908
qa: -0.0660 -0.0848 -0.1757 -0.4196 0.6180 -0.3477 -0.3538 -0.0917 -0.0728 -0.2854 0.2160 0.0369 0.0260 -0.1552 -0.2518 -0.1171 -0.1333 0.0823 0.1260 0.1292 0.0887 0.0439 0.0945 0.0704 0.1033 0.1024 0.1126 0.1511 0.1059 0.0993 0.0687 0.1306 0.1489
va: 1.2405 1.2139 2.2933 2.0343 5.4058 2.0704 2.1421 3.8660 3.8663 3.9507 3.7614 3.8560 3.9291 3.9660 3.9117 3.9757 3.9972 3.8260 1.0333 1.0029 1.0124 1.0272 1.0013 1.0073 1.0054 1.0016 0.9879 1.0079 1.0102 1.0053 1.0126 1.0172 1.0015
dispcorr: -0.021755524 hartree
energy: -2637.016032073338
dipole: 16.19639 -16.32743 -0.13104 -6.78166 6.71064 -0.07102 -2.42868 1.24204 -1.18664
magnitude: 1.19597 au
magnitude: 3.03990 debye
