program: Orca
programVersion: 5.0.2
elementType: Cl Cl S S P O O C C C C C C C C C C C H H H H H H H H H H H H H H H
charge: 0
multiplicity: 1
keywords: wb97x-d3
keywords: def2-TZVPP
keywords: def2/J RIJCOSX
keywords: DEFGRID2
keywords: scfconv7
keywords: smallprint printgap noloewdin
keywords: NOSOSCF
formula: C11H15Cl2O2PS2
InChI: InChI=1/C11H15Cl2O2PS2/c1-3-7-18-16(17,14-4-2)15-11-6-5-9(12)8-10(11)13/h5-6,8H,3-4,7H2,1-2H3
33 atoms
Cl -0.957512 2.876785 0.18091
Cl -5.604401 0.181887 0.160309
S  1.595849 -1.966667 -1.071395
S  0.8107 -0.22376 1.760479
P  1.2592 -0.166132 -0.106293
O  0.109494 0.470536 -1.08701
O  2.516076 0.710603 -0.539761
C  2.439706 -2.91624 0.243324
C  3.858801 -2.461121 0.525379
C  4.518513 -3.357494 1.56244
C  -1.221508 0.37651 -0.781776
C  2.751614 2.039325 -0.011809
C  -1.857901 1.456481 -0.181738
C  -1.944657 -0.763126 -1.088891
C  4.238918 2.261004 0.056869
C  -3.21096 1.405799 0.108779
C  -3.298438 -0.829568 -0.804525
C  -3.916284 0.254876 -0.203482
H  2.426783 -3.941221 -0.132442
H  1.815311 -2.887971 1.137021
H  4.435831 -2.470191 -0.401096
H  3.855277 -1.429986 0.88541
H  4.565833 -4.392973 1.22224
H  5.537701 -3.029245 1.766399
H  3.971126 -3.341908 2.506044
H  2.269994 2.756136 -0.677321
H  2.299818 2.131359 0.977431
H  -1.452995 -1.602013 -1.563629
H  4.705248 2.175215 -0.924573
H  4.431652 3.266398 0.430972
H  4.715262 1.552916 0.735054
H  -3.700005 2.249359 0.575753
H  -3.857431 -1.721528 -1.050134
elementType: Cl S P O C H
totalener: -2636.99899600 hartree
nucrepener: 2116.00496062 hartree
electener: -4753.00395662 hartree
oneelecener: -7844.42339081 hartree
twoeener: 3091.41943420 hartree
cpcmener: -0.01689936 hartree
kineticenergy: 2631.02296834 hartree
xcener: -154.150784189735 hartree
chargesum: 0.0000000
charge: -0.061225 -0.083285 -0.148011 -0.419501 0.619269 -0.370131 -0.337502 -0.095339 -0.077573 -0.266895 0.221838 0.042748 0.016698 -0.164472 -0.242318 -0.097194 -0.134222 0.060209 0.131657 0.115925 0.070976 0.050296 0.085881 0.093671 0.083763 0.107206 0.089804 0.154811 0.091056 0.092725 0.087800 0.132177 0.149156
qa: -0.0612 -0.0833 -0.1480 -0.4195 0.6193 -0.3701 -0.3375 -0.0953 -0.0776 -0.2669 0.2218 0.0427 0.0167 -0.1645 -0.2423 -0.0972 -0.1342 0.0602 0.1317 0.1159 0.0710 0.0503 0.0859 0.0937 0.0838 0.1072 0.0898 0.1548 0.0911 0.0927 0.0878 0.1322 0.1492
va: 1.2484 1.2170 2.3240 2.0213 5.3927 2.0955 2.0963 3.8550 3.8769 3.9515 3.7842 3.8244 3.9952 4.0285 3.9639 3.9990 4.0178 3.8779 1.0044 1.0284 1.0166 1.0278 1.0011 1.0036 1.0018 0.9970 1.0094 1.0028 1.0034 1.0068 1.0049 1.0145 1.0017
dispcorr: -0.017575528 hartree
energy: -2637.016571526895
dipole: 41.74268 -40.60855 1.13414 -14.22740 13.70096 -0.52644 4.63508 -5.06310 -0.42802
magnitude: 1.32159 au
magnitude: 3.35921 debye
