program: Orca
programVersion: 5.0.2
elementType: Cl Cl S S P O O C C C C C C C C C C C H H H H H H H H H H H H H H H
charge: 0
multiplicity: 1
keywords: wb97x-d3
keywords: def2-TZVPP
keywords: def2/J RIJCOSX
keywords: DEFGRID2
keywords: scfconv7
keywords: smallprint printgap noloewdin
keywords: NOSOSCF
formula: C11H15Cl2O2PS2
InChI: InChI=1/C11H15Cl2O2PS2/c1-3-7-18-16(17,14-4-2)15-11-6-5-9(12)8-10(11)13/h5-6,8H,3-4,7H2,1-2H3
33 atoms
Cl -0.993851 2.669561 -0.244111
Cl -5.395186 -0.333048 0.382957
S  2.904909 -1.042827 -0.852217
S  1.085224 0.278933 1.716457
P  1.509886 0.323413 -0.155288
O  0.235084 0.110761 -1.162083
O  2.07645 1.670755 -0.793819
C  2.697155 -2.436836 0.307743
C  1.420353 -3.232005 0.121489
C  1.393298 -4.434635 1.052663
C  -1.065088 0.018433 -0.753595
C  2.840782 2.627169 -0.030463
C  -1.769488 1.134817 -0.314495
C  -1.710477 -1.204076 -0.84372
C  4.252677 2.167825 0.2369
C  -3.1050 1.031598 0.039028
C  -3.046162 -1.322045 -0.500018
C  -3.728554 -0.201501 -0.054428
H  2.788572 -2.048269 1.32295
H  3.574248 -3.058456 0.116501
H  0.557173 -2.596071 0.327001
H  1.337203 -3.556987 -0.917353
H  1.448236 -4.127404 2.098165
H  0.47303 -5.004212 0.923918
H  2.230023 -5.10737 0.85862
H  2.834061 3.529541 -0.638564
H  2.315075 2.846044 0.900694
H  -1.163862 -2.067322 -1.199874
H  4.775356 1.914713 -0.685112
H  4.797558 2.980047 0.7185
H  4.28627 1.306725 0.904182
H  -3.645653 1.903707 0.380029
H  -3.541492 -2.27969 -0.578493
elementType: Cl S P O C H
totalener: -2636.99535408 hartree
nucrepener: 2149.17762735 hartree
electener: -4786.17298143 hartree
oneelecener: -7910.75762025 hartree
twoeener: 3124.58463882 hartree
cpcmener: -0.01801625 hartree
kineticenergy: 2631.03372964 hartree
xcener: -154.157638078609 hartree
chargesum: 0.0000000
charge: -0.061990 -0.084234 -0.156740 -0.417210 0.626530 -0.354295 -0.355854 -0.091214 -0.080983 -0.265873 0.206345 0.042934 0.032464 -0.167065 -0.248779 -0.107706 -0.142165 0.071898 0.113861 0.130287 0.042766 0.073969 0.083872 0.093290 0.088026 0.111668 0.092541 0.170503 0.090900 0.103160 0.078658 0.132557 0.147878
qa: -0.0620 -0.0842 -0.1567 -0.4172 0.6265 -0.3543 -0.3559 -0.0912 -0.0810 -0.2659 0.2063 0.0429 0.0325 -0.1671 -0.2488 -0.1077 -0.1422 0.0719 0.1139 0.1303 0.0428 0.0740 0.0839 0.0933 0.0880 0.1117 0.0925 0.1705 0.0909 0.1032 0.0787 0.1326 0.1479
va: 1.2550 1.2165 2.3177 2.0145 5.3745 2.0930 2.0879 3.8604 3.8795 3.9524 3.8051 3.8420 3.9675 3.9686 3.9207 4.0114 4.0095 3.8692 1.0270 1.0056 1.0280 1.0161 1.0015 1.0041 1.0014 0.9904 1.0112 0.9845 1.0046 1.0098 1.0143 1.0152 1.0024
dispcorr: -0.018364374 hartree
energy: -2637.013718450283
dipole: 29.19265 -28.26701 0.92565 -18.12814 17.22324 -0.90490 4.38533 -4.56952 -0.18419
magnitude: 1.30751 au
magnitude: 3.32344 debye
