program: Orca
programVersion: 5.0.2
elementType: Cl Cl S S P O O C C C C C C C C C C C H H H H H H H H H H H H H H H
charge: 0
multiplicity: 1
keywords: wb97x-d3
keywords: def2-TZVPP
keywords: def2/J RIJCOSX
keywords: DEFGRID2
keywords: scfconv7
keywords: smallprint printgap noloewdin
keywords: NOSOSCF
formula: C11H15Cl2O2PS2
InChI: InChI=1/C11H15Cl2O2PS2/c1-3-7-18-16(17,14-4-2)15-11-6-5-9(12)8-10(11)13/h5-6,8H,3-4,7H2,1-2H3
33 atoms
Cl -0.990534 0.66517 -2.637585
Cl -5.421062 0.0461 0.335568
S  1.163243 -1.462308 -0.923857
S  1.559406 -0.281904 2.267291
P  1.494309 0.11151 0.385138
O  0.315194 1.150515 -0.083962
O  2.737031 0.899274 -0.226733
C  1.720833 -2.929684 0.020393
C  3.150727 -3.346775 -0.2660
C  4.203492 -2.340577 0.163587
C  -1.01636 0.863488 0.047094
C  3.547847 1.799603 0.56489
C  -1.762689 0.620569 -1.100979
C  -1.640951 0.863415 1.283799
C  2.83181 3.085183 0.895291
C  -3.12225 0.36875 -1.021714
C  -2.999225 0.60929 1.379019
C  -3.724672 0.359234 0.225815
H  1.023111 -3.712421 -0.279362
H  1.553829 -2.73595 1.081185
H  3.306513 -4.289462 0.266246
H  3.260213 -3.575673 -1.328113
H  4.151332 -1.424181 -0.424782
H  4.094522 -2.070769 1.214998
H  5.20398 -2.75166 0.028476
H  3.875407 1.283777 1.468918
H  4.424086 1.987055 -0.052256
H  -1.070236 1.07755 2.176603
H  1.988385 2.926516 1.567973
H  3.530557 3.753446 1.399356
H  2.475649 3.590704 -0.002071
H  -3.695739 0.185056 -1.919845
H  -3.480241 0.610446 2.347008
elementType: Cl S P O C H
totalener: -2636.99540222 hartree
nucrepener: 2147.06771815 hartree
electener: -4784.06312037 hartree
oneelecener: -7906.68787418 hartree
twoeener: 3122.62475381 hartree
cpcmener: -0.01550722 hartree
kineticenergy: 2631.02662743 hartree
xcener: -154.155902934718 hartree
chargesum: 0.0000000
charge: -0.064316 -0.083840 -0.162730 -0.419182 0.642038 -0.360719 -0.352094 -0.097199 -0.075579 -0.275161 0.245485 0.039688 -0.024645 -0.178150 -0.237439 -0.082754 -0.128182 0.053398 0.128382 0.116292 0.074954 0.067572 0.074543 0.078515 0.100956 0.096598 0.114823 0.157576 0.077441 0.100736 0.091161 0.132754 0.149079
qa: -0.0643 -0.0838 -0.1627 -0.4192 0.6420 -0.3607 -0.3521 -0.0972 -0.0756 -0.2752 0.2455 0.0397 -0.0246 -0.1782 -0.2374 -0.0828 -0.1282 0.0534 0.1284 0.1163 0.0750 0.0676 0.0745 0.0785 0.1010 0.0966 0.1148 0.1576 0.0774 0.1007 0.0912 0.1328 0.1491
va: 1.2468 1.2168 2.3366 2.0231 5.3689 2.0978 2.0882 3.8630 3.8705 3.9276 3.7775 3.8310 4.0053 4.0189 3.9145 3.9929 3.9987 3.8836 1.0053 1.0398 1.0099 1.0128 1.0134 1.0098 1.0086 1.0098 0.9901 1.0042 1.0171 1.0084 1.0068 1.0141 1.0019
dispcorr: -0.018067198 hartree
energy: -2637.013469418208
dipole: 35.97606 -35.06935 0.90671 -5.79453 5.56743 -0.22710 9.70919 -9.40278 0.30641
magnitude: 0.98366 au
magnitude: 2.50027 debye
