program: Orca
programVersion: 5.0.2
elementType: Cl Cl S S P O O C C C C C C C C C C C H H H H H H H H H H H H H H H
charge: 0
multiplicity: 1
keywords: wb97x-d3
keywords: def2-TZVPP
keywords: def2/J RIJCOSX
keywords: DEFGRID2
keywords: scfconv7
keywords: smallprint printgap noloewdin
keywords: NOSOSCF
formula: C11H15Cl2O2PS2
InChI: InChI=1/C11H15Cl2O2PS2/c1-3-7-18-16(17,14-4-2)15-11-6-5-9(12)8-10(11)13/h5-6,8H,3-4,7H2,1-2H3
33 atoms
Cl -1.468669 -2.043707 -1.424663
Cl -5.295227 1.283557 0.338711
S  3.070746 -0.899202 -0.456088
S  1.270017 0.226987 2.215402
P  1.621878 0.34729 0.33209
O  0.344189 0.048612 -0.637221
O  2.036359 1.77038 -0.262369
C  2.960946 -2.351557 0.653453
C  1.740705 -3.227098 0.440262
C  1.656987 -3.849426 -0.941948
C  -0.949159 0.377206 -0.358946
C  3.073189 2.584591 0.323127
C  -1.928904 -0.546746 -0.709171
C  -1.325169 1.586217 0.206713
C  2.78814 4.02241 -0.022905
C  -3.270308 -0.272737 -0.504578
C  -2.663109 1.867708 0.42805
C  -3.623545 0.936303 0.071272
H  3.024771 -1.988432 1.67905
H  3.87944 -2.903438 0.444261
H  1.794021 -4.017115 1.194308
H  0.832888 -2.661612 0.661027
H  2.541768 -4.451945 -1.155498
H  0.786863 -4.501298 -1.020686
H  1.572496 -3.093706 -1.723301
H  3.090573 2.440982 1.405425
H  4.034932 2.262317 -0.079131
H  -0.582747 2.329223 0.465049
H  1.834492 4.347574 0.393284
H  3.571285 4.653626 0.396088
H  2.772745 4.180854 -1.10126
H  -4.021463 -0.997278 -0.78734
H  -2.945225 2.812376 0.871167
elementType: Cl S P O C H
totalener: -2636.99838264 hartree
nucrepener: 2127.37805145 hartree
electener: -4764.37643409 hartree
oneelecener: -7866.96166857 hartree
twoeener: 3102.58523448 hartree
cpcmener: -0.01671572 hartree
kineticenergy: 2631.01726371 hartree
xcener: -154.153139969090 hartree
chargesum: -0.0000000
charge: -0.067562 -0.085590 -0.154530 -0.421137 0.630286 -0.325537 -0.349954 -0.109130 -0.077325 -0.277645 0.216243 0.041402 0.029363 -0.151441 -0.244367 -0.106861 -0.151124 0.066749 0.129828 0.130149 0.085546 0.039564 0.097573 0.097860 0.067280 0.090559 0.104479 0.144680 0.088262 0.093121 0.090263 0.131372 0.147624
qa: -0.0676 -0.0856 -0.1545 -0.4211 0.6303 -0.3255 -0.3500 -0.1091 -0.0773 -0.2776 0.2162 0.0414 0.0294 -0.1514 -0.2444 -0.1069 -0.1511 0.0667 0.1298 0.1301 0.0855 0.0396 0.0976 0.0979 0.0673 0.0906 0.1045 0.1447 0.0883 0.0931 0.0903 0.1314 0.1476
va: 1.2464 1.2155 2.3202 2.0249 5.3891 2.1251 2.1124 3.8642 3.8493 3.9266 3.8001 3.8439 3.9483 3.9441 3.9566 4.0130 4.0197 3.8692 1.0269 1.0035 1.0092 1.0361 1.0056 1.0020 1.0164 1.0063 0.9957 1.0083 1.0046 1.0068 1.0038 1.0157 1.0031
dispcorr: -0.018242234 hartree
energy: -2637.016624877488
dipole: 28.61025 -27.30296 1.30729 -0.83318 1.29141 0.45823 2.32005 -2.33281 -0.01277
magnitude: 1.38533 au
magnitude: 3.52123 debye
