program: Orca
programVersion: 5.0.2
elementType: Cl Cl S S P O O C C C C C C C C C C C H H H H H H H H H H H H H H H
charge: 0
multiplicity: 1
keywords: wb97x-d3
keywords: def2-TZVPP
keywords: def2/J RIJCOSX
keywords: DEFGRID2
keywords: scfconv7
keywords: smallprint printgap noloewdin
keywords: NOSOSCF
formula: C11H15Cl2O2PS2
InChI: InChI=1/C11H15Cl2O2PS2/c1-3-7-18-16(17,14-4-2)15-11-6-5-9(12)8-10(11)13/h5-6,8H,3-4,7H2,1-2H3
33 atoms
Cl -1.224656 3.089593 -0.944262
Cl -5.336011 -0.123176 0.32583
S  1.909893 -1.608153 -1.303518
S  1.488414 -0.349897 1.86861
P  1.65375 -0.009936 -0.013823
O  0.366273 0.706214 -0.726412
O  2.790201 1.010175 -0.464699
C  2.916804 -2.757053 -0.287855
C  2.068883 -3.772927 0.454933
C  2.942266 -4.714713 1.271979
C  -0.942581 0.456528 -0.439675
C  3.289631 2.056674 0.401739
C  -1.824714 1.530113 -0.528015
C  -1.432553 -0.79688 -0.104253
C  2.31746 3.200287 0.55117
C  -3.179092 1.359274 -0.298477
C  -2.784333 -0.978965 0.136911
C  -3.646228 0.099412 0.037335
H  3.545778 -2.179005 0.3889
H  3.579831 -3.246193 -1.002488
H  1.367535 -3.253061 1.109593
H  1.474989 -4.342808 -0.26243
H  3.52405 -4.16997 2.017064
H  2.333261 -5.448644 1.799906
H  3.64227 -5.260712 0.637714
H  3.545428 1.626719 1.371654
H  4.210655 2.384129 -0.075639
H  -0.772281 -1.65168 -0.044623
H  2.799067 3.989697 1.128477
H  2.033873 3.616365 -0.414869
H  1.415114 2.905433 1.086377
H  -3.852427 2.201557 -0.377079
H  -3.152468 -1.961611 0.395648
elementType: Cl S P O C H
totalener: -2636.99566659 hartree
nucrepener: 2110.11040107 hartree
electener: -4747.10606765 hartree
oneelecener: -7832.32492348 hartree
twoeener: 3085.21885583 hartree
cpcmener: -0.01648359 hartree
kineticenergy: 2631.01498528 hartree
xcener: -154.152521345744 hartree
chargesum: 0.0000000
charge: -0.067846 -0.086053 -0.158052 -0.420050 0.636244 -0.334447 -0.348643 -0.078489 -0.103519 -0.262983 0.229036 0.035730 0.021648 -0.133398 -0.239647 -0.110739 -0.176499 0.076060 0.109499 0.132406 0.063391 0.072325 0.083137 0.093974 0.085478 0.096925 0.113207 0.133794 0.103024 0.087238 0.071365 0.129556 0.146328
qa: -0.0678 -0.0861 -0.1581 -0.4200 0.6362 -0.3344 -0.3486 -0.0785 -0.1035 -0.2630 0.2290 0.0357 0.0216 -0.1334 -0.2396 -0.1107 -0.1765 0.0761 0.1095 0.1324 0.0634 0.0723 0.0831 0.0940 0.0855 0.0969 0.1132 0.1338 0.1030 0.0872 0.0714 0.1296 0.1463
va: 1.2440 1.2151 2.2969 2.0140 5.3744 2.1343 2.1155 3.8447 3.8852 3.9509 3.7949 3.8471 3.9492 3.9416 3.8938 4.0188 4.0787 3.8639 1.0266 1.0071 1.0249 1.0129 1.0024 1.0038 1.0014 1.0098 0.9916 1.0068 1.0105 1.0078 1.0221 1.0166 1.0046
dispcorr: -0.017705458 hartree
energy: -2637.013372045175
dipole: 31.36193 -30.09308 1.26886 -17.85005 17.10782 -0.74223 8.12067 -8.14988 -0.02921
magnitude: 1.47029 au
magnitude: 3.73718 debye
