program: Orca
programVersion: 5.0.2
elementType: Cl Cl S S P O O C C C C C C C C C C C H H H H H H H H H H H H H H H
charge: 0
multiplicity: 1
keywords: wb97x-d3
keywords: def2-TZVPP
keywords: def2/J RIJCOSX
keywords: DEFGRID2
keywords: scfconv7
keywords: smallprint printgap noloewdin
keywords: NOSOSCF
formula: C11H15Cl2O2PS2
InChI: InChI=1/C11H15Cl2O2PS2/c1-3-7-18-16(17,14-4-2)15-11-6-5-9(12)8-10(11)13/h5-6,8H,3-4,7H2,1-2H3
33 atoms
Cl -1.087669 3.047664 -0.648299
Cl -5.61932 0.349902 0.38159
S  1.582191 -2.012478 -1.104636
S  0.966059 -0.394204 1.850051
P  1.295509 -0.262691 -0.037277
O  0.088591 0.417388 -0.909306
O  2.510632 0.647218 -0.515833
C  2.536382 -3.006463 0.097812
C  3.965949 -2.538711 0.292891
C  4.718867 -3.472674 1.22818
C  -1.231603 0.359486 -0.569778
C  2.758453 1.946879 0.079185
C  -1.924274 1.557477 -0.437838
C  -1.900178 -0.840691 -0.393172
C  3.948514 1.877273 0.999393
C  -3.279418 1.563291 -0.151889
C  -3.252294 -0.850431 -0.096552
C  -3.929109 0.352462 0.020503
H  2.50851 -4.013064 -0.323988
H  1.981274 -3.02974 1.036254
H  4.469221 -2.490086 -0.674466
H  3.975391 -1.527292 0.705043
H  4.766016 -4.486057 0.826917
H  5.741962 -3.127663 1.377594
H  4.241385 -3.524391 2.20781
H  2.940122 2.619754 -0.757452
H  1.873517 2.306164 0.607564
H  -1.372815 -1.779219 -0.504287
H  4.156402 2.87398 1.389298
H  3.760082 1.217806 1.846081
H  4.838948 1.531102 0.474688
H  -3.812295 2.499371 -0.059448
H  -3.765732 -1.792023 0.037291
elementType: Cl S P O C H
totalener: -2636.99807575 hartree
nucrepener: 2105.38635463 hartree
electener: -4742.38443038 hartree
oneelecener: -7822.96064263 hartree
twoeener: 3080.57621225 hartree
cpcmener: -0.01655373 hartree
kineticenergy: 2631.02440187 hartree
xcener: -154.151893240419 hartree
chargesum: -0.0000000
charge: -0.064830 -0.084210 -0.145614 -0.420286 0.620843 -0.351290 -0.344306 -0.098994 -0.070075 -0.268098 0.226419 0.056421 0.007614 -0.156633 -0.251838 -0.094929 -0.136358 0.058560 0.132335 0.117021 0.070237 0.047066 0.087486 0.093664 0.083928 0.110973 0.079157 0.138522 0.104204 0.078911 0.093837 0.130796 0.149467
qa: -0.0648 -0.0842 -0.1456 -0.4203 0.6208 -0.3513 -0.3443 -0.0990 -0.0701 -0.2681 0.2264 0.0564 0.0076 -0.1566 -0.2518 -0.0949 -0.1364 0.0586 0.1323 0.1170 0.0702 0.0471 0.0875 0.0937 0.0839 0.1110 0.0792 0.1385 0.1042 0.0789 0.0938 0.1308 0.1495
va: 1.2465 1.2165 2.3151 2.0146 5.3818 2.1187 2.0862 3.8611 3.8853 3.9520 3.7697 3.8440 3.9915 3.9760 3.9319 4.0032 4.0260 3.8771 1.0034 1.0264 1.0171 1.0223 1.0011 1.0037 1.0018 0.9954 1.0167 1.0227 1.0094 1.0141 1.0024 1.0153 1.0015
dispcorr: -0.017757047 hartree
energy: -2637.015832801126
dipole: 42.13436 -40.92052 1.21383 -16.25714 15.63260 -0.62454 7.68026 -7.87437 -0.19411
magnitude: 1.37881 au
magnitude: 3.50466 debye
