program: Orca
programVersion: 5.0.2
elementType: Cl Cl S S P O O C C C C C C C C C C C H H H H H H H H H H H H H H H
charge: 0
multiplicity: 1
keywords: wb97x-d3
keywords: def2-TZVPP
keywords: def2/J RIJCOSX
keywords: DEFGRID2
keywords: scfconv7
keywords: smallprint printgap noloewdin
keywords: NOSOSCF
formula: C11H15Cl2O2PS2
InChI: InChI=1/C11H15Cl2O2PS2/c1-3-7-18-16(17,14-4-2)15-11-6-5-9(12)8-10(11)13/h5-6,8H,3-4,7H2,1-2H3
33 atoms
Cl -1.430888 -1.763777 -1.757209
Cl -5.42552 0.888881 0.661231
S  2.87014 -0.550894 -0.955296
S  1.043553 0.031159 1.899742
P  1.465054 0.539547 0.095704
O  0.195697 0.489811 -0.936853
O  1.960145 2.03643 -0.155375
C  2.316115 -2.264216 -0.599553
C  3.020629 -2.880128 0.592798
C  2.505772 -4.287986 0.85115
C  -1.10279 0.611445 -0.528722
C  2.766348 2.770727 0.793305
C  -1.993156 -0.400337 -0.868117
C  -1.558475 1.712641 0.179326
C  4.194318 2.289909 0.833543
C  -3.330015 -0.318572 -0.513635
C  -2.889457 1.804258 0.549106
C  -3.761799 0.785144 0.202176
H  2.528126 -2.818359 -1.514732
H  1.2331 -2.267323 -0.473087
H  4.096971 -2.900754 0.410147
H  2.8582 -2.257098 1.473689
H  3.012249 -4.736683 1.70561
H  1.435986 -4.283939 1.065897
H  2.668746 -4.938783 -0.009156
H  2.711079 3.802542 0.451893
H  2.300271 2.714145 1.778323
H  -0.880447 2.51589 0.434275
H  4.28033 1.286043 1.249079
H  4.649516 2.299693 -0.156741
H  4.769919 2.960997 1.471498
H  -4.015095 -1.109295 -0.785799
H  -3.234817 2.666197 1.102357
elementType: Cl S P O C H
totalener: -2636.99655486 hartree
nucrepener: 2120.20005854 hartree
electener: -4757.19661339 hartree
oneelecener: -7852.63265211 hartree
twoeener: 3095.43603872 hartree
cpcmener: -0.01717053 hartree
kineticenergy: 2631.01454038 hartree
xcener: -154.151438033657 hartree
chargesum: 0.0000000
charge: -0.068445 -0.084796 -0.148127 -0.422517 0.630586 -0.344388 -0.357387 -0.062012 -0.103012 -0.265397 0.203583 0.042967 0.022251 -0.151973 -0.250124 -0.106621 -0.139203 0.068352 0.134252 0.080768 0.072200 0.063154 0.093627 0.083030 0.084750 0.112210 0.096771 0.157692 0.078684 0.093924 0.104060 0.131493 0.149651
qa: -0.0684 -0.0848 -0.1481 -0.4225 0.6306 -0.3444 -0.3574 -0.0620 -0.1030 -0.2654 0.2036 0.0430 0.0223 -0.1520 -0.2501 -0.1066 -0.1392 0.0684 0.1343 0.0808 0.0722 0.0632 0.0936 0.0830 0.0848 0.1122 0.0968 0.1577 0.0787 0.0939 0.1041 0.1315 0.1497
va: 1.2436 1.2158 2.3057 2.0147 5.3889 2.1160 2.0958 3.8472 3.9099 3.9504 3.8087 3.8389 3.9743 3.9593 3.9106 4.0229 3.9942 3.8687 1.0059 1.0418 1.0142 1.0281 1.0040 1.0019 1.0014 0.9904 1.0098 0.9975 1.0145 1.0024 1.0108 1.0151 1.0016
dispcorr: -0.017864483 hartree
energy: -2637.014419341186
dipole: 34.68452 -33.62150 1.06303 -5.89123 6.41310 0.52187 8.94430 -8.91253 0.03177
magnitude: 1.18465 au
magnitude: 3.01113 debye
