program: Orca
programVersion: 5.0.2
elementType: Cl Cl S S P O O C C C C C C C C C C C H H H H H H H H H H H H H H H
charge: 0
multiplicity: 1
keywords: wb97x-d3
keywords: def2-TZVPP
keywords: def2/J RIJCOSX
keywords: DEFGRID2
keywords: scfconv7
keywords: smallprint printgap noloewdin
keywords: NOSOSCF
formula: C11H15Cl2O2PS2
InChI: InChI=1/C11H15Cl2O2PS2/c1-3-7-18-16(17,14-4-2)15-11-6-5-9(12)8-10(11)13/h5-6,8H,3-4,7H2,1-2H3
33 atoms
Cl -1.191145 3.095891 -0.945626
Cl -5.400711 0.008497 0.316213
S  1.816004 -1.680624 -1.285787
S  1.391214 -0.39229 1.878308
P  1.587315 -0.072985 -0.005084
O  0.32251 0.66021 -0.739456
O  2.757975 0.91199 -0.44507
C  3.015914 -2.711733 -0.357383
C  2.345238 -3.760912 0.510066
C  3.381508 -4.585192 1.260881
C  -0.992939 0.454632 -0.447589
C  3.285796 1.941096 0.426006
C  -1.840554 1.555362 -0.533306
C  -1.519897 -0.783511 -0.112797
C  2.350814 3.115928 0.568487
C  -3.199681 1.425646 -0.304429
C  -2.876264 -0.924713 0.129061
C  -3.704652 0.179938 0.029758
H  3.669839 -2.060744 0.223112
H  3.632613 -3.175103 -1.128219
H  1.672669 -3.274124 1.217762
H  1.733544 -4.411928 -0.117595
H  3.982963 -3.958732 1.92121
H  2.900842 -5.346453 1.875356
H  4.060709 -5.093954 0.575076
H  3.520293 1.502584 1.397288
H  4.220383 2.238124 -0.044924
H  -0.884695 -1.657307 -0.05427
H  2.088883 3.541742 -0.399362
H  1.434992 2.850496 1.096173
H  2.853587 3.888718 1.150325
H  -3.847174 2.288044 -0.382346
H  -3.273802 -1.8960 0.387315
elementType: Cl S P O C H
totalener: -2636.99594476 hartree
nucrepener: 2107.43395737 hartree
electener: -4744.42990213 hartree
oneelecener: -7827.00322035 hartree
twoeener: 3082.57331822 hartree
cpcmener: -0.01662979 hartree
kineticenergy: 2631.01765777 hartree
xcener: -154.152930152607 hartree
chargesum: 0.0000000
charge: -0.067516 -0.085855 -0.156417 -0.421090 0.635147 -0.336570 -0.348806 -0.080303 -0.101140 -0.264523 0.245848 0.038818 0.009083 -0.148458 -0.240168 -0.101548 -0.161807 0.066069 0.110084 0.133109 0.064592 0.070251 0.083141 0.093902 0.085106 0.097008 0.113539 0.129198 0.087785 0.070855 0.103031 0.130047 0.147587
qa: -0.0675 -0.0859 -0.1564 -0.4211 0.6351 -0.3366 -0.3488 -0.0803 -0.1011 -0.2645 0.2458 0.0388 0.0091 -0.1485 -0.2402 -0.1015 -0.1618 0.0661 0.1101 0.1331 0.0646 0.0703 0.0831 0.0939 0.0851 0.0970 0.1135 0.1292 0.0878 0.0709 0.1030 0.1300 0.1476
va: 1.2444 1.2153 2.2989 2.0123 5.3804 2.1318 2.1116 3.8543 3.8891 3.9502 3.7751 3.8403 3.9590 3.9524 3.8979 4.0084 4.0625 3.8715 1.0226 1.0055 1.0269 1.0130 1.0025 1.0037 1.0013 1.0109 0.9918 1.0197 1.0076 1.0222 1.0105 1.0161 1.0032
dispcorr: -0.017604337 hartree
energy: -2637.013549094123
dipole: 33.47645 -32.08285 1.39360 -17.76272 17.06627 -0.69646 8.07299 -8.14609 -0.07309
magnitude: 1.55965 au
magnitude: 3.96431 debye
