program: Orca
programVersion: 5.0.2
elementType: Cl Cl S S P O O C C C C C C C C C C C H H H H H H H H H H H H H H H
charge: 0
multiplicity: 1
keywords: wb97x-d3
keywords: def2-TZVPP
keywords: def2/J RIJCOSX
keywords: DEFGRID2
keywords: scfconv7
keywords: smallprint printgap noloewdin
keywords: NOSOSCF
formula: C11H15Cl2O2PS2
InChI: InChI=1/C11H15Cl2O2PS2/c1-3-7-18-16(17,14-4-2)15-11-6-5-9(12)8-10(11)13/h5-6,8H,3-4,7H2,1-2H3
33 atoms
Cl -1.518744 2.122486 1.48013
Cl -4.74885 -1.773916 -0.290402
S  1.973807 -1.032434 -1.103757
S  1.830841 0.903347 1.679675
P  1.620531 0.822679 -0.226145
O  0.180334 1.346543 -0.818952
O  2.481636 1.822071 -1.120529
C  1.816372 -2.188746 0.302619
C  0.391813 -2.495693 0.721736
C  0.379281 -3.496823 1.867913
C  -0.970565 0.615597 -0.693443
C  3.767959 2.320146 -0.695549
C  -1.847473 0.862317 0.357884
C  -1.295786 -0.336073 -1.647213
C  4.864849 1.294846 -0.843605
C  -3.01633 0.128672 0.483594
C  -2.46116 -1.074455 -1.535872
C  -3.301068 -0.846078 -0.45826
H  2.406049 -1.791534 1.129581
H  2.319729 -3.089763 -0.054088
H  -0.110451 -1.577494 1.033318
H  -0.166924 -2.889421 -0.129338
H  0.865783 -4.432168 1.586719
H  0.898732 -3.102492 2.742837
H  -0.641481 -3.732682 2.168322
H  3.950385 3.183053 -1.332536
H  3.696513 2.673115 0.335124
H  -0.63504 -0.497201 -2.487195
H  5.818657 1.770311 -0.614495
H  4.74021 0.458224 -0.155924
H  4.918749 0.907198 -1.860869
H  -3.692758 0.322053 1.304675
H  -2.700837 -1.819029 -2.282002
elementType: Cl S P O C H
totalener: -2636.99380531 hartree
nucrepener: 2170.23760436 hartree
electener: -4807.23140967 hartree
oneelecener: -7952.72734534 hartree
twoeener: 3145.49593566 hartree
cpcmener: -0.01709629 hartree
kineticenergy: 2631.02172820 hartree
xcener: -154.155702616560 hartree
chargesum: -0.0000000
charge: -0.059375 -0.083325 -0.161246 -0.412731 0.623791 -0.351843 -0.357383 -0.075006 -0.091926 -0.259873 0.210884 0.038167 0.014159 -0.155894 -0.245984 -0.103810 -0.148901 0.076479 0.112095 0.133983 0.046315 0.073517 0.088353 0.083979 0.093119 0.111732 0.096115 0.155493 0.103048 0.078554 0.090932 0.127586 0.148997
qa: -0.0594 -0.0833 -0.1612 -0.4127 0.6238 -0.3518 -0.3574 -0.0750 -0.0919 -0.2599 0.2109 0.0382 0.0142 -0.1559 -0.2460 -0.1038 -0.1489 0.0765 0.1121 0.1340 0.0463 0.0735 0.0884 0.0840 0.0931 0.1117 0.0961 0.1555 0.1030 0.0786 0.0909 0.1276 0.1490
va: 1.2477 1.2174 2.3130 2.0419 5.3944 2.1069 2.1075 3.8350 3.9012 3.9528 3.7915 3.8489 3.9533 3.9552 3.8934 4.0250 3.9750 3.8619 1.0299 1.0026 1.0174 1.0122 1.0012 1.0022 1.0040 0.9914 1.0128 1.0014 1.0103 1.0132 1.0053 1.0182 1.0014
dispcorr: -0.019433866 hartree
energy: -2637.013239179469
dipole: 27.39390 -26.46569 0.92821 -14.17126 12.97593 -1.19533 -0.09001 -0.78531 -0.87532
magnitude: 1.74830 au
magnitude: 4.44383 debye
