program: Orca
programVersion: 5.0.2
elementType: Cl Cl S S P O O C C C C C C C C C C C H H H H H H H H H H H H H H H
charge: 0
multiplicity: 1
keywords: wb97x-d3
keywords: def2-TZVPP
keywords: def2/J RIJCOSX
keywords: DEFGRID2
keywords: scfconv7
keywords: smallprint printgap noloewdin
keywords: NOSOSCF
formula: C11H15Cl2O2PS2
InChI: InChI=1/C11H15Cl2O2PS2/c1-3-7-18-16(17,14-4-2)15-11-6-5-9(12)8-10(11)13/h5-6,8H,3-4,7H2,1-2H3
33 atoms
Cl -1.191243 2.993376 -1.096252
Cl -5.33065 -0.137093 0.275806
S  1.988899 -1.688936 -1.036257
S  1.451105 -0.175336 2.001244
P  1.670914 0.005022 0.101874
O  0.391909 0.62174 -0.709105
O  2.814813 0.995523 -0.398356
C  3.212619 -2.593806 -0.005325
C  2.573619 -3.609966 0.92189
C  1.865534 -4.739214 0.194035
C  -0.921933 0.395647 -0.427512
C  3.277027 2.118624 0.390599
C  -1.799845 1.461859 -0.599214
C  -1.419052 -0.83523 -0.026391
C  2.288985 3.25649 0.412354
C  -3.159199 1.304387 -0.389534
C  -2.775912 -1.002882 0.196966
C  -3.634241 0.067453 0.012265
H  3.814464 -1.867626 0.539837
H  3.872249 -3.078135 -0.726171
H  3.37541 -4.020663 1.541867
H  1.886831 -3.102335 1.601319
H  1.039917 -4.372112 -0.416635
H  2.550267 -5.279027 -0.461016
H  1.451101 -5.45602 0.902453
H  3.507622 1.774614 1.399949
H  4.20881 2.416666 -0.086543
H  -0.760998 -1.684194 0.098394
H  1.371394 2.994527 0.938486
H  2.741898 4.097752 0.937649
H  2.035178 3.587265 -0.594021
H  -3.830091 2.1392 -0.534949
H  -3.14987 -1.968124 0.507076
elementType: Cl S P O C H
totalener: -2636.99535731 hartree
nucrepener: 2117.87448678 hartree
electener: -4754.86984409 hartree
oneelecener: -7847.90501507 hartree
twoeener: 3093.03517098 hartree
cpcmener: -0.01667522 hartree
kineticenergy: 2631.02506953 hartree
xcener: -154.155331182868 hartree
chargesum: 0.0000000
charge: -0.067121 -0.085829 -0.161774 -0.423513 0.643650 -0.335865 -0.350064 -0.095880 -0.108640 -0.254940 0.238133 0.039432 0.014696 -0.143083 -0.238915 -0.104017 -0.164962 0.069446 0.122681 0.129305 0.081868 0.066270 0.072561 0.087627 0.092394 0.096617 0.113393 0.130074 0.069608 0.102795 0.087395 0.129675 0.146984
qa: -0.0671 -0.0858 -0.1618 -0.4235 0.6436 -0.3359 -0.3501 -0.0959 -0.1086 -0.2549 0.2381 0.0394 0.0147 -0.1431 -0.2389 -0.1040 -0.1650 0.0694 0.1227 0.1293 0.0819 0.0663 0.0726 0.0876 0.0924 0.0966 0.1134 0.1301 0.0696 0.1028 0.0874 0.1297 0.1470
va: 1.2449 1.2152 2.2897 2.0104 5.3762 2.1320 2.1119 3.8589 3.8989 3.9303 3.7776 3.8411 3.9555 3.9561 3.8973 4.0115 4.0636 3.8685 1.0233 1.0067 1.0084 1.0258 1.0110 1.0008 1.0045 1.0109 0.9918 1.0130 1.0228 1.0106 1.0076 1.0164 1.0034
dispcorr: -0.017906507 hartree
energy: -2637.013263818252
dipole: 29.81627 -28.40644 1.40983 -16.82826 16.17984 -0.64843 6.22956 -6.22631 0.00325
magnitude: 1.55180 au
magnitude: 3.94437 debye
