program: Orca
programVersion: 5.0.2
elementType: Cl Cl S S P O O C C C C C C C C C C C H H H H H H H H H H H H H H H
charge: 0
multiplicity: 1
keywords: wb97x-d3
keywords: def2-TZVPP
keywords: def2/J RIJCOSX
keywords: DEFGRID2
keywords: scfconv7
keywords: smallprint printgap noloewdin
keywords: NOSOSCF
formula: C11H15Cl2O2PS2
InChI: InChI=1/C11H15Cl2O2PS2/c1-3-7-18-16(17,14-4-2)15-11-6-5-9(12)8-10(11)13/h5-6,8H,3-4,7H2,1-2H3
33 atoms
Cl -0.839285 2.784625 0.646947
Cl -5.557414 0.401826 -0.320354
S  1.759652 -1.825002 -1.119322
S  0.580872 -0.660363 1.854602
P  1.268668 -0.227922 0.121164
O  0.261244 0.569813 -0.897263
O  2.501724 0.77294 0.18648
C  2.437542 -3.009906 0.094855
C  3.789853 -2.624151 0.661777
C  4.291364 -3.688908 1.625169
C  -1.096003 0.503096 -0.754704
C  3.152989 1.336133 -0.978307
C  -1.752353 1.503949 -0.050033
C  -1.820486 -0.529222 -1.322778
C  2.792467 2.790816 -1.132058
C  -3.130211 1.484436 0.082604
C  -3.198821 -0.565451 -1.195548
C  -3.837929 0.440533 -0.490708
H  2.501385 -3.944928 -0.464344
H  1.692421 -3.147508 0.878672
H  4.501082 -2.484763 -0.154251
H  3.718209 -1.668338 1.18486
H  3.608115 -3.813219 2.466541
H  4.392098 -4.65691 1.132723
H  5.26694 -3.419712 2.029433
H  4.220799 1.213372 -0.804618
H  2.901424 0.768114 -1.876017
H  -1.307766 -1.305764 -1.874231
H  3.356178 3.204888 -1.968607
H  1.733075 2.931737 -1.340989
H  3.052774 3.361984 -0.241367
H  -3.63673 2.266945 0.6290
H  -3.760142 -1.373911 -1.641232
elementType: Cl S P O C H
totalener: -2636.99774534 hartree
nucrepener: 2127.10486776 hartree
electener: -4764.10261310 hartree
oneelecener: -7866.64445358 hartree
twoeener: 3102.54184048 hartree
cpcmener: -0.01905729 hartree
kineticenergy: 2631.04085699 hartree
xcener: -154.155723862193 hartree
chargesum: 0.0000000
charge: -0.061224 -0.083620 -0.165900 -0.407172 0.603193 -0.361808 -0.339379 -0.083430 -0.096160 -0.264816 0.241088 0.057361 0.004787 -0.177390 -0.250636 -0.096952 -0.127310 0.061534 0.132336 0.114484 0.071676 0.061808 0.083741 0.085554 0.093994 0.109797 0.095672 0.153489 0.099719 0.072525 0.091788 0.131891 0.149363
qa: -0.0612 -0.0836 -0.1659 -0.4072 0.6032 -0.3618 -0.3394 -0.0834 -0.0962 -0.2648 0.2411 0.0574 0.0048 -0.1774 -0.2506 -0.0970 -0.1273 0.0615 0.1323 0.1145 0.0717 0.0618 0.0837 0.0856 0.0940 0.1098 0.0957 0.1535 0.0997 0.0725 0.0918 0.1319 0.1494
va: 1.2514 1.2168 2.3027 2.0531 5.4112 2.0827 2.0901 3.8424 3.8743 3.9529 3.7364 3.8213 4.0226 4.0532 3.9491 4.0024 4.0123 3.8762 1.0039 1.0286 1.0166 1.0277 1.0019 1.0006 1.0039 0.9917 1.0050 1.0045 1.0087 1.0185 1.0026 1.0148 1.0013
dispcorr: -0.017985720 hartree
energy: -2637.015731055488
dipole: 38.16269 -36.74891 1.41379 -15.52214 14.77188 -0.75026 -2.00888 0.29690 -1.71197
magnitude: 2.34362 au
magnitude: 5.95700 debye
