program: Orca
programVersion: 5.0.2
elementType: Cl Cl S S P O O C C C C C C C C C C C H H H H H H H H H H H H H H H
charge: 0
multiplicity: 1
keywords: wb97x-d3
keywords: def2-TZVPP
keywords: def2/J RIJCOSX
keywords: DEFGRID2
keywords: scfconv7
keywords: smallprint printgap noloewdin
keywords: NOSOSCF
formula: C11H15Cl2O2PS2
InChI: InChI=1/C11H15Cl2O2PS2/c1-3-7-18-16(17,14-4-2)15-11-6-5-9(12)8-10(11)13/h5-6,8H,3-4,7H2,1-2H3
33 atoms
Cl -1.026741 0.242334 -2.650827
Cl -5.493503 0.240585 0.333845
S  1.124981 -1.607408 -0.661773
S  1.457306 -0.051359 2.35023
P  1.432078 0.11973 0.434094
O  0.275504 1.096797 -0.190983
O  2.704223 0.805825 -0.238487
C  1.9971 -2.835344 0.380007
C  3.508292 -2.700733 0.397867
C  4.157536 -2.807906 -0.970213
C  -1.063841 0.867836 -0.031321
C  3.54756 1.74182 0.47364
C  -1.809873 0.469485 -1.135594
C  -1.695223 1.081494 1.182896
C  2.886824 3.083126 0.665472
C  -3.177223 0.27587 -1.032349
C  -3.061203 0.887157 1.302008
C  -3.78767 0.482102 0.194028
H  1.697821 -3.79046 -0.056195
H  1.574229 -2.786587 1.382842
H  3.794708 -1.764303 0.882165
H  3.881221 -3.498743 1.045641
H  3.864503 -1.984365 -1.622115
H  5.243875 -2.786122 -0.884478
H  3.883365 -3.740368 -1.466493
H  3.840979 1.304509 1.429312
H  4.438651 1.828262 -0.144763
H  -1.122564 1.417187 2.036219
H  3.606505 3.765361 1.118801
H  2.56885 3.514899 -0.282979
H  2.026324 3.024823 1.33235
H  -3.750101 -0.031715 -1.896148
H  -3.547324 1.056651 2.252383
elementType: Cl S P O C H
totalener: -2636.99655147 hartree
nucrepener: 2141.27647243 hartree
electener: -4778.27302390 hartree
oneelecener: -7895.06920759 hartree
twoeener: 3116.79618369 hartree
cpcmener: -0.01629147 hartree
kineticenergy: 2631.02936074 hartree
xcener: -154.155972913633 hartree
chargesum: 0.0000000
charge: -0.063285 -0.083392 -0.165455 -0.423366 0.634176 -0.360226 -0.347695 -0.109090 -0.085682 -0.260786 0.247389 0.047865 -0.023431 -0.179963 -0.240846 -0.082956 -0.127042 0.052377 0.132842 0.126550 0.054150 0.085474 0.072380 0.094924 0.087670 0.094545 0.113787 0.156709 0.100211 0.091556 0.077671 0.133389 0.149550
qa: -0.0633 -0.0834 -0.1655 -0.4234 0.6342 -0.3602 -0.3477 -0.1091 -0.0857 -0.2608 0.2474 0.0479 -0.0234 -0.1800 -0.2408 -0.0830 -0.1270 0.0524 0.1328 0.1265 0.0542 0.0855 0.0724 0.0949 0.0877 0.0945 0.1138 0.1567 0.1002 0.0916 0.0777 0.1334 0.1495
va: 1.2486 1.2172 2.3305 2.0171 5.3817 2.1006 2.0869 3.8791 3.8604 3.9403 3.7695 3.8287 4.0085 4.0225 3.9122 3.9901 3.9968 3.8842 1.0022 1.0302 1.0242 1.0080 1.0144 1.0048 1.0008 1.0125 0.9907 1.0047 1.0087 1.0065 1.0166 1.0135 1.0015
dispcorr: -0.017669573 hartree
energy: -2637.014221041045
dipole: 37.64712 -36.52453 1.12259 -4.87742 4.79147 -0.08595 7.45021 -7.15013 0.30008
magnitude: 1.16518 au
magnitude: 2.96165 debye
