program: Orca
programVersion: 5.0.2
elementType: Cl Cl S S P O O C C C C C C C C C C C H H H H H H H H H H H H H H H
charge: 0
multiplicity: 1
keywords: wb97x-d3
keywords: def2-TZVPP
keywords: def2/J RIJCOSX
keywords: DEFGRID2
keywords: scfconv7
keywords: smallprint printgap noloewdin
keywords: NOSOSCF
formula: C11H15Cl2O2PS2
InChI: InChI=1/C11H15Cl2O2PS2/c1-3-7-18-16(17,14-4-2)15-11-6-5-9(12)8-10(11)13/h5-6,8H,3-4,7H2,1-2H3
33 atoms
Cl -1.035649 0.213535 -2.648625
Cl -5.496288 0.268771 0.344355
S  1.147473 -1.609071 -0.674792
S  1.417451 -0.073045 2.354411
P  1.427893 0.1116 0.43952
O  0.276227 1.087959 -0.19875
O  2.707423 0.808185 -0.205626
C  2.024576 -2.836658 0.363947
C  3.533977 -2.683168 0.404785
C  4.206823 -2.788057 -0.952284
C  -1.064271 0.87082 -0.036241
C  3.530729 1.750056 0.520488
C  -1.814248 0.462036 -1.134115
C  -1.693703 1.107436 1.174833
C  2.870117 3.097979 0.666325
C  -3.182356 0.277296 -1.026263
C  -3.06039 0.92168 1.298711
C  -3.790133 0.502766 0.198095
H  1.743532 -3.791454 -0.084983
H  1.587315 -2.803892 1.361709
H  3.801541 -1.742224 0.890657
H  3.906293 -3.473936 1.060997
H  3.979341 -3.740918 -1.433471
H  3.888102 -1.990699 -1.624587
H  5.29004 -2.718308 -0.853051
H  3.787041 1.328362 1.493796
H  4.444586 1.8220 -0.065007
H  -1.117997 1.453311 2.022211
H  2.588851 3.515168 -0.300272
H  1.985275 3.053795 1.301849
H  3.575392 3.784905 1.134363
H  -3.758091 -0.038914 -1.885124
H  -3.544732 1.108224 2.246921
elementType: Cl S P O C H
totalener: -2636.99664514 hartree
nucrepener: 2140.00815796 hartree
electener: -4777.00480310 hartree
oneelecener: -7892.53154238 hartree
twoeener: 3115.52673928 hartree
cpcmener: -0.01632622 hartree
kineticenergy: 2631.02401310 hartree
xcener: -154.154995078967 hartree
chargesum: -0.0000000
charge: -0.063434 -0.083424 -0.165526 -0.423296 0.633902 -0.361788 -0.346437 -0.107981 -0.086249 -0.259212 0.251864 0.047838 -0.025577 -0.181931 -0.239913 -0.082405 -0.125776 0.051525 0.132232 0.126957 0.053550 0.085345 0.087305 0.071805 0.094826 0.094433 0.113437 0.156079 0.091502 0.077295 0.100124 0.133264 0.149666
qa: -0.0634 -0.0834 -0.1655 -0.4233 0.6339 -0.3618 -0.3464 -0.1080 -0.0862 -0.2592 0.2519 0.0478 -0.0256 -0.1819 -0.2399 -0.0824 -0.1258 0.0515 0.1322 0.1270 0.0536 0.0853 0.0873 0.0718 0.0948 0.0944 0.1134 0.1561 0.0915 0.0773 0.1001 0.1333 0.1497
va: 1.2483 1.2172 2.3307 2.0180 5.3838 2.0994 2.0879 3.8784 3.8625 3.9404 3.7648 3.8283 4.0116 4.0216 3.9149 3.9890 3.9944 3.8846 1.0023 1.0295 1.0244 1.0081 1.0010 1.0147 1.0046 1.0128 0.9906 1.0049 1.0063 1.0156 1.0088 1.0135 1.0014
dispcorr: -0.017652044 hartree
energy: -2637.014297182833
dipole: 37.81824 -36.66917 1.14907 -4.67006 4.61246 -0.05760 7.51430 -7.20528 0.30902
magnitude: 1.19129 au
magnitude: 3.02801 debye
