program: Orca
programVersion: 5.0.2
elementType: Cl Cl S S P O O C C C C C C C C C C C H H H H H H H H H H H H H H H
charge: 0
multiplicity: 1
keywords: wb97x-d3
keywords: def2-TZVPP
keywords: def2/J RIJCOSX
keywords: DEFGRID2
keywords: scfconv7
keywords: smallprint printgap noloewdin
keywords: NOSOSCF
formula: C11H15Cl2O2PS2
InChI: InChI=1/C11H15Cl2O2PS2/c1-3-7-18-16(17,14-4-2)15-11-6-5-9(12)8-10(11)13/h5-6,8H,3-4,7H2,1-2H3
33 atoms
Cl -1.407807 -2.152901 -1.197589
Cl -5.403691 1.009719 0.487717
S  3.018322 -0.690244 -0.615151
S  1.15768 0.433872 2.033754
P  1.536956 0.535765 0.153779
O  0.251556 0.185427 -0.796177
O  1.896505 1.959058 -0.475684
C  3.041163 -2.060371 0.597713
C  1.886894 -3.033784 0.468817
C  1.823303 -3.742397 -0.872273
C  -1.048577 0.411417 -0.449014
C  3.181168 2.613857 -0.386376
C  -1.955973 -0.629332 -0.61485
C  -1.499545 1.639612 0.010568
C  3.637898 2.893279 1.022811
C  -3.301048 -0.451295 -0.335699
C  -2.839456 1.828824 0.304039
C  -3.727905 0.780463 0.129837
H  3.094673 -1.620605 1.592952
H  3.995254 -2.554794 0.404786
H  2.013093 -3.769878 1.267538
H  0.945039 -2.521718 0.676217
H  1.011692 -4.469859 -0.888031
H  1.653618 -3.043801 -1.691997
H  2.751435 -4.278591 -1.078084
H  3.920473 2.017586 -0.92398
H  3.042965 3.542555 -0.936453
H  -0.813464 2.468016 0.125757
H  3.878518 1.983643 1.571583
H  4.544666 3.496489 0.969619
H  2.893633 3.454898 1.586111
H  -3.996963 -1.266827 -0.475739
H  -3.179066 2.790706 0.661038
elementType: Cl S P O C H
totalener: -2636.99435687 hartree
nucrepener: 2140.14113993 hartree
electener: -4777.13549680 hartree
oneelecener: -7892.74129715 hartree
twoeener: 3115.60580035 hartree
cpcmener: -0.01709435 hartree
kineticenergy: 2631.01767074 hartree
xcener: -154.155816461177 hartree
chargesum: 0.0000000
charge: -0.067614 -0.085722 -0.153083 -0.423885 0.638138 -0.336251 -0.349665 -0.102411 -0.076924 -0.279456 0.211392 0.014560 0.025137 -0.166883 -0.235732 -0.100914 -0.133011 0.058582 0.128052 0.131764 0.084980 0.036001 0.099032 0.069679 0.097680 0.103228 0.111132 0.149646 0.079032 0.103571 0.090010 0.131076 0.148858
qa: -0.0676 -0.0857 -0.1531 -0.4239 0.6381 -0.3363 -0.3497 -0.1024 -0.0769 -0.2795 0.2114 0.0146 0.0251 -0.1669 -0.2357 -0.1009 -0.1330 0.0586 0.1281 0.1318 0.0850 0.0360 0.0990 0.0697 0.0977 0.1032 0.1111 0.1496 0.0790 0.1036 0.0900 0.1311 0.1489
va: 1.2471 1.2152 2.3176 2.0122 5.3600 2.1135 2.1213 3.8561 3.8541 3.9212 3.8141 3.8759 3.9603 3.9634 3.8932 4.0097 3.9964 3.8768 1.0297 1.0041 1.0103 1.0411 1.0014 1.0166 1.0055 0.9950 0.9899 1.0148 1.0145 1.0103 1.0079 1.0155 1.0017
dispcorr: -0.018627777 hartree
energy: -2637.012984651608
dipole: 32.12542 -30.49145 1.63397 -2.48537 2.88443 0.39906 3.25447 -3.53244 -0.27797
magnitude: 1.70481 au
magnitude: 4.33329 debye
