program: Gaussian 09
title: 000066511
version: EM64L-G09RevD.01
frameworkgroup: C1[X(C10H7NO8S3)]
method: RPBEPBE
basis: SDD
operation: Freq
keyword: #p
keyword: freq=noraman
keyword: PBEPBE/SDD
title: #p freq=noraman PBEPBE/SDD
converged: YES YES NO NO
title: Mulliken charges:
elementType: S S S O O O O O O O O N C C C C C C C C C C H H H H H H H
charge: 0.963706 1.001914 0.979730 -0.455908 -0.454287 -0.550316 -0.559550 -0.465437 -0.517585 -0.484854 -0.491175 -0.738614 0.147098 0.600586 -0.170093 0.697903 -0.303881 -0.361074 -0.277979 -0.294002 -0.385580 -0.218262 0.398164 0.323464 0.280408 0.298320 0.255566 0.393429 0.388309
chargesum: 0.00000
title: Mulliken charges with hydrogens summed into heavy atoms:
elementType: S S S O O O O O O O O N C C C C C C C C C C
charge: 0.963706 1.001914 0.979730 -0.455908 -0.454287 -0.156888 -0.171242 -0.465437 -0.517585 -0.484854 -0.491175 -0.340450 0.147098 0.600586 -0.170093 0.697903 -0.303881 -0.361074 0.045485 -0.013594 -0.087260 0.037304
polarizability: 2.92659235e+02 1.08928375e+01 2.73805915e+02 9.86953052e-01 -2.02462841e+00 1.36114845e+02
1716.lowfreq: -2.6168 0.0010 0.0011 0.0020 4.2990 6.0232 33.6359 37.8973 42.8429
frequency: 33.6209 37.8779 42.8420 66.4182 90.8471 98.8447 105.7085 120.6364 141.2839 171.5861 182.5906 184.1658 199.7464 204.2539 227.0904 231.9495 239.5784 259.4096 262.5557 296.3164 300.8493 312.7731 321.7924 333.7196 339.0605 393.0002 403.8526 413.3330 431.4270 456.4774 494.2748 496.3769 506.9459 510.9646 540.4070 560.1397 592.4341 640.2745 651.4058 672.8147 686.4139 742.4602 750.5089 803.0762 812.5043 830.2478 832.2505 849.4037 895.1419 922.4276 931.3771 951.6879 964.9579 974.0296 976.0039 1003.0935 1043.0048 1047.1447 1052.3110 1094.9979 1147.2011 1185.6874 1193.7967 1230.9111 1288.1597 1343.5234 1389.8017 1418.1627 1439.6823 1460.2061 1490.6809 1573.3936 1580.0041 1629.6371 3126.9807 3158.5462 3171.7374 3183.0507 3394.1401 3474.1298 3478.6839
redmass: 8.3204 10.6800 9.6650 8.1030 8.5842 11.7550 9.8548 12.0472 7.1289 5.3388 4.3368 2.7199 8.0311 2.5183 5.8259 5.4807 3.1235 2.8723 5.7835 4.4451 8.0722 8.2505 8.2454 11.1841 10.1624 11.0157 10.8939 7.8683 12.5920 11.3957 5.2924 6.0754 5.5456 6.5183 13.6715 11.2665 6.8588 4.8631 4.8389 9.5134 2.5687 3.8708 1.5659 2.8415 2.3411 11.3136 7.1458 15.5033 1.9438 6.3483 1.4144 9.8502 8.4112 5.5917 7.1187 1.4242 2.5040 1.2049 1.2161 2.4073 2.2917 1.6048 1.5615 1.4382 2.4075 3.6770 2.6817 3.2736 7.8357 4.1098 4.9309 7.8099 9.6044 8.0205 1.0919 1.0882 1.0935 1.0994 1.0818 1.0662 1.0662
irintensity: 2.3015 0.7389 2.2878 0.4215 1.0261 1.2474 0.0115 0.7807 0.9100 6.3772 26.5352 29.8944 2.0046 18.0346 10.5579 2.8655 17.7977 55.6120 25.0265 61.3062 41.1015 14.2262 24.0994 2.8372 9.7640 17.0613 60.5588 25.8386 98.1553 106.2037 29.6240 6.9972 4.1784 20.0937 204.8637 43.2855 32.3532 7.9769 3.6770 53.8857 3.5361 29.5462 118.1927 48.0416 10.0983 99.4775 45.2269 142.4705 21.7863 13.8584 11.4823 104.1460 61.5490 29.0188 97.1442 0.5031 3.5520 105.6944 79.6718 32.0627 0.4937 33.1431 27.7560 7.3387 47.5013 25.4813 19.1762 14.5405 8.1404 37.4847 64.8462 28.0051 239.3485 50.5920 28.5783 3.4561 3.5072 1.6770 274.7370 64.0073 54.6741
temp: 298.150 k
press: 1.00000 atm
elementType: 16 16 16 8 8 8 8 8 8 8 8 7 6 6 6 6 6 6 6 6 6 6 1 1 1 1 1 1 1
symmnumber: 1
zpe: 437180.1 jmol-1
zpe.correction: 0.166513 hartree
zpe.thermalcorrener: 0.188622 hartree
zpe.thermalcorrenthalpy: 0.189566 hartree
zpe.thermalcorrgfe: 0.115160 hartree
zpe.sumelectzpe: -2233.860641 hartree
zpe.sumelectthermal: -2233.838532 hartree
zpe.sumelectthermalent: -2233.837587 hartree
zpe.sumelectthermalfe: -2233.911993 hartree
dipole: 1.3858 -3.4033 0.1837
dipole: 3.6792
quadrupole: -177.0992 -132.7842 -160.4407
quadrupole: -9.5749 -11.1333 11.2760
quadrupole: -20.3244 23.9905 -3.6660 -9.5749 -11.1333 11.2760
hfenergy: -2234.0271538 hartree
pointgroup: C01 [X(C10H7N1O8S3)]
dipole: -0.6377378 -1.299442 -0.0001637 debye
polarizability: 291.0632534|-12.0860617|275.2661021|0.0476803|-4.9081794|136.250639 unknown
InChI: InChI=1S/C10H7NO8S3/c12-20(13)6-3-1-2-5-7(21(14,15)16)4-8(22(17,18)19)10(11-20)9(5)6/h1-4,11,14,17H
charge 0 multiplicity 1
29 atoms
S  3.217419 -1.318278 0.063195
S  0.864531 3.247445 -0.072725
S  -3.56238 -0.084893 -0.074132
O  3.954076 -1.575636 1.475732
O  4.026515 -1.600377 -1.303888
O  0.71514 3.469968 -1.901248
O  -3.712823 -0.608558 1.701869
O  -0.127685 4.287496 0.65707
O  2.445269 3.192692 0.321177
O  -4.181057 1.394159 -0.271005
O  -4.079194 -1.316598 -0.98984
N  2.479152 0.44731 0.03023
C  0.531883 -0.891124 -0.007169
C  1.117988 0.438815 -0.007334
C  1.436143 -1.96825 0.022476
C  -0.876912 -1.136238 -0.035461
C  0.213719 1.520551 -0.032432
C  -1.703844 0.039346 -0.053681
C  -1.18965 1.329209 -0.051503
C  1.050255 -3.300926 0.021556
C  -1.299737 -2.505725 -0.038899
C  -0.359753 -3.547095 -0.010896
H  3.035731 1.314906 0.099145
H  -1.865706 2.193934 -0.057411
H  1.767412 -4.125997 0.044563
H  -2.36788 -2.736183 -0.077396
H  -0.710414 -4.583649 -0.014796
H  0.904511 4.429881 -2.118268
H  -4.686306 -0.727384 1.906471
