program: Orca
programVersion: 5.0.2
elementType: Cl Cl S S P O O C C C C C C C C C C C H H H H H H H H H H H H H H H
charge: 0
multiplicity: 1
keywords: wb97x-d3
keywords: def2-TZVPP
keywords: def2/J RIJCOSX
keywords: DEFGRID2
keywords: scfconv7
keywords: smallprint printgap noloewdin
keywords: NOSOSCF
formula: C11H15Cl2O2PS2
InChI: InChI=1/C11H15Cl2O2PS2/c1-3-7-18-16(17,14-4-2)15-11-6-5-9(12)8-10(11)13/h5-6,8H,3-4,7H2,1-2H3
33 atoms
Cl -1.294003 -1.970932 -1.220293
Cl -5.512017 1.089262 0.040883
S  1.680065 -1.70486 0.84623
S  0.898477 1.188884 2.208143
P  1.36503 0.305881 0.570148
O  0.272324 0.474668 -0.649867
O  2.67147 0.782663 -0.20686
C  2.231237 -2.284545 -0.810731
C  3.740058 -2.330748 -0.964727
C  4.428104 -3.273389 0.007087
C  -1.069869 0.611705 -0.45221
C  2.890422 2.177231 -0.52472
C  -1.925006 -0.459178 -0.691039
C  -1.601726 1.834094 -0.070065
C  4.370956 2.447588 -0.47231
C  -3.295505 -0.317357 -0.541478
C  -2.968476 1.991471 0.082285
C  -3.802748 0.909255 -0.147713
H  1.763911 -1.668513 -1.57731
H  1.800373 -3.282877 -0.902319
H  3.939139 -2.654911 -1.990608
H  4.155038 -1.325987 -0.875014
H  4.293342 -2.957429 1.043043
H  4.041743 -4.290589 -0.08432
H  5.501248 -3.310097 -0.182807
H  2.483965 2.36857 -1.518903
H  2.358166 2.811115 0.188554
H  -0.941576 2.674428 0.095672
H  4.552152 3.492583 -0.726367
H  4.772064 2.270712 0.525955
H  4.919326 1.830631 -1.184975
H  -3.951655 -1.156069 -0.730431
H  -3.37091 2.950506 0.377876
elementType: Cl S P O C H
totalener: -2637.01154250 hartree
nucrepener: 2121.09034679 hartree
electener: -4758.10188929 hartree
oneelecener: -7854.18373143 hartree
twoeener: 3096.08184214 hartree
cpcmener: -0.01638634 hartree
kineticenergy: 2631.00091622 hartree
xcener: -154.148238141676 hartree
chargesum: -0.0000000
charge: -0.063450 -0.083166 -0.141867 -0.420231 0.605226 -0.354351 -0.323640 -0.119684 -0.095895 -0.255873 0.266518 0.037922 0.003274 -0.175432 -0.241445 -0.100990 -0.124700 0.057245 0.115351 0.132914 0.074822 0.065253 0.075128 0.084724 0.091788 0.105879 0.089447 0.148744 0.092884 0.087982 0.089730 0.129150 0.146745
qa: -0.0634 -0.0832 -0.1419 -0.4202 0.6052 -0.3544 -0.3236 -0.1197 -0.0959 -0.2559 0.2665 0.0379 0.0033 -0.1754 -0.2414 -0.1010 -0.1247 0.0572 0.1154 0.1329 0.0748 0.0653 0.0751 0.0847 0.0918 0.1059 0.0894 0.1487 0.0929 0.0880 0.0897 0.1292 0.1467
va: 1.2478 1.2178 2.3187 2.0377 5.4079 2.0594 2.1125 3.8701 3.9261 3.9253 3.7316 3.8394 4.0290 4.0039 3.9553 4.0028 3.9872 3.8815 1.0295 1.0010 1.0080 1.0217 1.0148 1.0000 1.0054 0.9963 1.0071 1.0003 1.0074 1.0068 1.0025 1.0148 1.0018
dispcorr: -0.017827732 hartree
energy: -2637.029370230828
dipole: 41.85354 -40.70820 1.14534 -1.02020 1.38945 0.36925 -6.02383 4.14871 -1.87512
magnitude: 2.22806 au
magnitude: 5.66327 debye
