program: Orca
programVersion: 5.0.2
elementType: Cl Cl S S P O O C C C C C C C C C C C H H H H H H H H H H H H H H H
charge: 0
multiplicity: 1
keywords: wb97x-d3
keywords: def2-TZVPP
keywords: def2/J RIJCOSX
keywords: DEFGRID2
keywords: scfconv7
keywords: smallprint printgap noloewdin
keywords: NOSOSCF
formula: C11H15Cl2O2PS2
InChI: InChI=1/C11H15Cl2O2PS2/c1-3-7-18-16(17,14-4-2)15-11-6-5-9(12)8-10(11)13/h5-6,8H,3-4,7H2,1-2H3
33 atoms
Cl -1.930733 -2.011005 1.280207
Cl -5.293659 1.659723 -0.73847
S  2.473732 -1.19816 1.417241
S  1.186388 1.825801 1.509029
P  1.436752 0.275517 0.411333
O  0.102935 -0.504673 -0.101147
O  2.111122 0.499887 -1.022792
C  2.198232 -2.729904 0.4430
C  2.863997 -2.79317 -0.918055
C  4.372071 -2.624582 -0.880809
C  -1.12738 0.059298 -0.241215
C  3.369264 1.195952 -1.15327
C  -2.204549 -0.585542 0.356006
C  -1.343348 1.208115 -0.985752
C  3.149834 2.585677 -1.693915
C  -3.492812 -0.102487 0.200729
C  -2.625328 1.709515 -1.137882
C  -3.687983 1.048743 -0.54388
H  1.125228 -2.902903 0.380256
H  2.605286 -3.4998 1.102629
H  2.617611 -3.776739 -1.328641
H  2.413001 -2.067347 -1.596082
H  4.837671 -3.370986 -0.234172
H  4.79916 -2.739745 -1.877452
H  4.664506 -1.641194 -0.510276
H  3.896217 1.228129 -0.196379
H  3.969765 0.597646 -1.837733
H  -0.516577 1.708794 -1.472067
H  4.117019 3.061678 -1.860762
H  2.621736 2.563486 -2.647789
H  2.586372 3.204033 -0.995518
H  -4.325124 -0.616056 0.661637
H  -2.784408 2.605579 -1.72144
elementType: Cl S P O C H
totalener: -2637.01080895 hartree
nucrepener: 2122.83618661 hartree
electener: -4759.84699556 hartree
oneelecener: -7857.52697754 hartree
twoeener: 3097.67998198 hartree
cpcmener: -0.01640836 hartree
kineticenergy: 2631.01342027 hartree
xcener: -154.152179666607 hartree
chargesum: 0.0000000
charge: -0.063579 -0.083663 -0.148807 -0.410550 0.595748 -0.331593 -0.323856 -0.103488 -0.117815 -0.264788 0.223123 0.047074 0.000778 -0.150526 -0.242436 -0.103206 -0.142790 0.066949 0.116734 0.132886 0.086290 0.070542 0.092203 0.096943 0.070498 0.090877 0.102241 0.151766 0.099769 0.088992 0.078569 0.128568 0.146547
qa: -0.0636 -0.0837 -0.1488 -0.4105 0.5957 -0.3316 -0.3239 -0.1035 -0.1178 -0.2648 0.2231 0.0471 0.0008 -0.1505 -0.2424 -0.1032 -0.1428 0.0669 0.1167 0.1329 0.0863 0.0705 0.0922 0.0969 0.0705 0.0909 0.1022 0.1518 0.0998 0.0890 0.0786 0.1286 0.1465
va: 1.2488 1.2170 2.3151 2.0470 5.4087 2.1243 2.0590 3.8915 3.8934 3.9337 3.7723 3.8445 4.0059 3.9750 3.9538 4.0059 4.0156 3.8733 1.0257 0.9988 1.0081 1.0198 1.0020 1.0035 1.0091 1.0061 0.9889 0.9975 1.0085 1.0032 1.0182 1.0164 1.0030
dispcorr: -0.018723740 hartree
energy: -2637.029532687160
dipole: 39.20132 -37.84958 1.35174 -5.03120 4.12690 -0.90431 -14.90471 13.12829 -1.77641
magnitude: 2.40845 au
magnitude: 6.12178 debye
