program: Orca
programVersion: 5.0.2
elementType: Cl Cl S S P O O C C C C C C C C C C C H H H H H H H H H H H H H H H
charge: 0
multiplicity: 1
keywords: wb97x-d3
keywords: def2-TZVPP
keywords: def2/J RIJCOSX
keywords: DEFGRID2
keywords: scfconv7
keywords: smallprint printgap noloewdin
keywords: NOSOSCF
formula: C11H15Cl2O2PS2
InChI: InChI=1/C11H15Cl2O2PS2/c1-3-7-18-16(17,14-4-2)15-11-6-5-9(12)8-10(11)13/h5-6,8H,3-4,7H2,1-2H3
33 atoms
Cl -0.470748 2.003691 -2.072464
Cl -5.100933 1.903523 0.641682
S  2.377444 -1.771406 -1.344041
S  0.911995 -1.528934 1.791343
P  1.242206 -0.754368 0.058106
O  -0.070129 -0.656618 -0.915445
O  1.862038 0.715957 0.074078
C  4.076494 -1.524821 -0.703414
C  4.397037 -2.190119 0.622355
C  4.101884 -3.678759 0.664343
C  -1.237891 -0.066717 -0.520956
C  1.977545 1.539951 1.254118
C  -1.554771 1.198335 -1.004552
C  -2.130609 -0.727831 0.307319
C  0.694678 2.263297 1.576124
C  -2.746489 1.810074 -0.652392
C  -3.324702 -0.127116 0.669483
C  -3.616498 1.140683 0.19258
H  4.281526 -0.454982 -0.678389
H  4.690607 -1.947332 -1.501475
H  5.462925 -2.017966 0.797921
H  3.871085 -1.682456 1.432921
H  4.459114 -4.114865 1.597675
H  3.031354 -3.877871 0.599198
H  4.591112 -4.207548 -0.15654
H  2.305843 0.92885 2.096364
H  2.775327 2.243374 1.019595
H  -1.897373 -1.722719 0.660435
H  -0.109796 1.571961 1.829668
H  0.86188 2.905263 2.442219
H  0.369647 2.896553 0.751223
H  -2.985851 2.793207 -1.033746
H  -4.016081 -0.64949 1.316194
elementType: Cl S P O C H
totalener: -2637.00703548 hartree
nucrepener: 2149.18977292 hartree
electener: -4786.19680839 hartree
oneelecener: -7910.44135047 hartree
twoeener: 3124.24454208 hartree
cpcmener: -0.01512646 hartree
kineticenergy: 2631.00578887 hartree
xcener: -154.150982041885 hartree
chargesum: -0.0000000
charge: -0.065258 -0.082328 -0.148772 -0.423852 0.627119 -0.349516 -0.331809 -0.130669 -0.098534 -0.257220 0.240718 0.054686 -0.016535 -0.181898 -0.251338 -0.082444 -0.120059 0.054854 0.129996 0.130498 0.084189 0.058875 0.094798 0.067803 0.088413 0.093654 0.111491 0.150158 0.078887 0.110161 0.087070 0.128960 0.147902
qa: -0.0653 -0.0823 -0.1488 -0.4239 0.6271 -0.3495 -0.3318 -0.1307 -0.0985 -0.2572 0.2407 0.0547 -0.0165 -0.1819 -0.2513 -0.0824 -0.1201 0.0549 0.1300 0.1305 0.0842 0.0589 0.0948 0.0678 0.0884 0.0937 0.1115 0.1502 0.0789 0.1102 0.0871 0.1290 0.1479
va: 1.2435 1.2187 2.3010 2.0045 5.3913 2.1216 2.1065 3.9054 3.8663 3.9271 3.7828 3.8144 3.9821 4.0269 3.9310 3.9852 3.9926 3.8904 1.0140 0.9984 1.0085 1.0254 1.0049 1.0202 1.0019 1.0139 0.9914 1.0099 1.0098 1.0120 1.0103 1.0172 1.0014
dispcorr: -0.019638711 hartree
energy: -2637.026674185784
dipole: 31.95676 -30.68722 1.26954 -11.31214 11.98952 0.67739 12.56500 -12.17324 0.39176
magnitude: 1.49133 au
magnitude: 3.79065 debye
