program: Gaussian 09
title: 000066489
version: EM64L-G09RevD.01
frameworkgroup: C1[X(C21H12N2O3)]
method: RPBEPBE
basis: SDD
operation: Freq
keyword: #p
keyword: freq=noraman
keyword: PBEPBE/SDD
title: #p freq=noraman PBEPBE/SDD
converged: YES YES NO YES
title: Mulliken charges:
elementType: O O O N N C C C C C C C C C C C C C C C C C C C C C H H H H H H H H H H H H
charge: -0.308221 -0.293131 -0.245575 -0.462986 -0.671469 0.192135 0.065362 0.121627 0.262376 0.340918 -0.159865 0.291689 -0.713776 0.278445 -0.148753 0.235283 0.182795 0.029427 -0.388295 -0.383220 -0.387879 -0.349830 -0.230278 -0.228257 -0.206999 -0.262944 0.387261 0.283958 0.293148 0.293851 0.249899 0.278463 0.318269 0.388133 0.239278 0.239367 0.233585 0.236211
chargesum: 0.00000
title: Mulliken charges with hydrogens summed into heavy atoms:
elementType: O O O N N C C C C C C C C C C C C C C C C C C C C C
charge: -0.308221 -0.293131 -0.245575 -0.075725 0.034932 0.192135 0.065362 0.121627 0.262376 0.340918 -0.159865 0.291689 -0.429818 0.278445 -0.148753 0.235283 0.182795 0.029427 -0.095148 -0.089369 -0.137980 -0.071367 0.009000 0.011110 0.026585 -0.026733
polarizability: 5.42672544e+02 2.00234097e+01 3.26765554e+02 -2.57219492e-02 -7.08337087e-03 9.15705498e+01
1716.lowfreq: -6.5375 -6.1953 -0.0007 0.0006 0.0011 4.9360 36.2612 46.2978 90.5030
frequency: 36.2504 46.2956 90.5027 97.4120 117.1706 133.3609 150.3026 171.7499 212.0506 230.0142 241.3952 254.6368 291.2139 303.1357 321.6255 351.8494 381.3687 404.6750 419.3396 421.9055 424.4162 447.9968 449.9375 475.2943 499.7527 509.5712 525.8537 531.5459 540.3189 551.6582 591.2342 613.9449 639.0433 643.8016 662.7969 705.8536 706.0180 733.0266 734.8417 746.2578 771.5611 778.3288 805.8827 812.6845 830.3403 852.4550 862.4834 871.3830 880.8081 898.0179 934.0296 942.9811 954.2885 961.5035 975.5977 997.2708 999.7308 1014.3243 1015.8138 1029.9795 1041.3965 1082.7666 1096.2889 1110.7600 1136.2794 1170.3390 1172.2793 1177.1799 1216.9378 1247.7809 1256.5454 1272.2277 1286.1350 1307.9496 1329.2977 1358.6913 1379.0231 1392.2142 1404.1868 1411.2335 1430.6187 1442.4697 1451.2513 1464.7413 1477.5137 1481.9403 1515.9659 1524.6084 1540.5564 1565.6972 1577.7978 1588.8439 1600.3491 1608.7723 1621.4476 1642.1719 3074.9105 3132.1539 3134.4708 3136.8805 3145.2905 3153.6189 3156.1932 3166.7180 3171.8619 3174.4107 3284.3931 3622.7725
redmass: 6.5158 7.1910 6.1909 5.2792 5.8139 5.8833 6.7294 6.0141 6.3375 5.1866 5.5952 8.2382 5.7434 5.4753 7.0557 7.1014 5.4712 8.8278 10.4126 3.8423 4.0720 3.5811 8.4200 6.1098 7.5555 3.3076 1.3631 9.0996 3.5637 5.9674 7.0061 5.2155 6.7368 6.8549 4.9703 7.2180 4.0695 6.7875 2.3576 4.5276 1.4276 6.5295 1.9466 3.1097 1.1647 6.3276 2.7852 7.5236 1.5316 6.0587 1.9290 1.5739 1.1499 5.0440 1.3544 1.3895 1.3388 1.3649 4.0610 2.0986 2.2152 2.4682 2.1415 1.6753 2.5743 1.1674 1.0723 1.8680 1.9171 1.8266 2.0903 2.1906 2.7369 2.3253 4.1756 4.3690 4.4510 7.8466 9.4984 7.3042 3.4436 3.4460 3.0717 3.3051 2.7982 4.0238 7.7679 5.9199 10.1000 2.9323 4.5547 1.9522 4.0758 6.3957 5.7806 7.1979 1.0851 1.0866 1.0914 1.0864 1.0894 1.0907 1.0946 1.0944 1.1004 1.0996 1.0616 1.0903
irintensity: 0.3304 1.5786 7.9211 0.8965 0.8316 1.2072 0.0038 0.0016 0.0002 0.3162 0.0754 0.3060 6.4999 1.7596 12.5982 2.2338 0.1888 16.1986 13.6549 0.4973 1.8494 7.6072 5.2153 7.7171 0.7618 22.6905 91.1768 6.5449 11.2728 2.5552 2.0136 34.9331 6.9591 3.1371 4.7547 1.2648 0.8446 3.4924 18.2968 5.1403 84.9299 3.5072 65.3528 2.7076 115.7468 8.5055 0.1920 3.6993 0.1616 10.6220 2.9252 4.9447 85.0549 21.4055 25.0480 6.4899 0.1286 0.0046 98.9189 4.9264 11.7986 7.3483 0.7362 18.2380 2.0444 0.8581 8.9926 20.9518 16.5415 5.5707 44.3002 22.2472 217.0791 31.1343 458.7940 273.4323 54.6226 0.4930 21.0282 12.5772 6.5798 4.3804 16.0064 10.8307 112.0272 5.2178 535.5765 86.6213 352.1736 97.2865 95.5286 235.9543 49.0296 1.1658 191.2237 45.4269 79.9309 2.7044 6.3726 3.9089 7.0906 13.9681 7.0495 1.5546 35.7173 32.8331 44.1191 70.3894
temp: 298.150 k
press: 1.00000 atm
elementType: 8 8 8 7 7 6 6 6 6 6 6 6 6 6 6 6 6 6 6 6 6 6 6 6 6 6 1 1 1 1 1 1 1 1 1 1 1 1
symmnumber: 1
zpe: 731736.6 jmol-1
zpe.correction: 0.278704 hartree
zpe.thermalcorrener: 0.297212 hartree
zpe.thermalcorrenthalpy: 0.298156 hartree
zpe.thermalcorrgfe: 0.232673 hartree
zpe.sumelectzpe: -1140.969825 hartree
zpe.sumelectthermal: -1140.951317 hartree
zpe.sumelectthermalent: -1140.950373 hartree
zpe.sumelectthermalfe: -1141.015856 hartree
dipole: -1.3514 -1.8605 0.0048
dipole: 2.2995
quadrupole: -132.5911 -134.3888 -153.8461
quadrupole: -6.8758 0.0004 0.0046
quadrupole: 7.6842 5.8865 -13.5708 -6.8758 0.0004 0.0046
hfenergy: -1141.2485289 hartree
pointgroup: C01[X(C21H12N2O3)]
dipole: -0.5366283 -0.7283534 0.0018715 debye
polarizability: 542.9336996|18.5602658|326.5043991|-0.0257693|-0.0069091|91.5705498 unknown
InChI: InChI=1S/C21H12N2O3/c22-14-9-13-18(23-15-8-4-3-7-12(15)19(13)24)17-16(14)20(25)10-5-1-2-6-11(10)21(17)26/h1-9,23H,22H2
charge 0 multiplicity 1
38 atoms
O  -0.668082 -2.354544 -0.000341
O  -3.50851 2.392976 -0.000084
O  3.638237 2.531736 -0.000992
N  1.562483 -1.072894 0.000615
N  -1.304977 3.763406 0.000455
C  -0.606766 0.068754 0.000585
C  0.829457 0.098464 0.000419
C  -1.345356 1.304438 0.000533
C  1.522726 1.362215 0.000064
C  -0.635356 2.564178 0.000294
C  -1.310636 -1.226134 0.000759
C  -2.791614 -1.231572 0.000473
C  0.792844 2.551593 0.000008
C  -3.522412 -0.0089 0.000465
C  -2.817076 1.297988 0.000619
C  2.956678 -1.10681 0.000262
C  3.70888 0.110936 -0.000188
C  3.016656 1.41552 -0.000071
C  -3.487604 -2.467924 0.00014
C  -4.940087 -0.037889 0.000164
C  3.63149 -2.359553 0.000345
C  5.128838 0.047678 -0.00061
C  -4.894566 -2.487381 -0.000126
C  -5.623194 -1.268423 -0.000109
C  5.034712 -2.394173 -0.000067
C  5.792374 -1.188178 -0.000561
H  0.967722 -1.936982 0.001215
H  1.362068 3.489121 -0.000131
H  -2.900201 -3.390806 0.000134
H  -5.474511 0.916739 0.000146
H  3.048697 -3.28739 0.000707
H  5.675582 0.996311 -0.000926
H  -0.788137 4.640395 0.000268
H  -2.338113 3.718127 0.001111
H  -5.429245 -3.443137 -0.000357
H  -6.718223 -1.28695 -0.000332
H  5.55024 -3.360795 -0.000015
H  6.886083 -1.230139 -0.000871
