program: Orca
programVersion: 5.0.2
elementType: Cl Cl S S P O O C C C C C C C C C C C H H H H H H H H H H H H H H H
charge: 0
multiplicity: 1
keywords: wb97x-d3
keywords: def2-TZVPP
keywords: def2/J RIJCOSX
keywords: DEFGRID2
keywords: scfconv7
keywords: smallprint printgap noloewdin
keywords: NOSOSCF
formula: C11H15Cl2O2PS2
InChI: InChI=1/C11H15Cl2O2PS2/c1-3-7-18-16(17,14-4-2)15-11-6-5-9(12)8-10(11)13/h5-6,8H,3-4,7H2,1-2H3
33 atoms
Cl -0.654269 -0.668884 -2.243854
Cl -4.867503 2.182589 -0.532546
S  2.562028 -1.983479 0.977242
S  1.363338 0.510177 2.762732
P  1.308516 -0.350862 1.045906
O  -0.118952 -1.042451 0.631467
O  1.603517 0.568155 -0.222732
C  2.268101 -2.743095 -0.669742
C  3.012552 -2.095574 -1.82255
C  4.524241 -2.143173 -1.683328
C  -1.214133 -0.26706 0.366941
C  1.894297 1.980916 -0.160959
C  -1.583169 -0.016076 -0.949967
C  -1.985046 0.236538 1.402632
C  0.646874 2.80405 -0.35488
C  -2.710317 0.737799 -1.234427
C  -3.113856 0.991549 1.133229
C  -3.460777 1.240927 -0.184459
H  1.195118 -2.786469 -0.848301
H  2.603141 -3.772724 -0.526544
H  2.711813 -2.635308 -2.725477
H  2.676181 -1.067575 -1.959072
H  4.882133 -3.170688 -1.591931
H  5.007961 -1.70194 -2.555356
H  4.868284 -1.592147 -0.80666
H  2.377565 2.218553 0.788031
H  2.614011 2.15994 -0.958496
H  -1.710555 0.022553 2.426614
H  0.164061 2.58696 -1.307788
H  -0.07352 2.645131 0.448645
H  0.918136 3.860959 -0.352827
H  -2.992657 0.927191 -2.261025
H  -3.712432 1.377229 1.946821
elementType: Cl S P O C H
totalener: -2637.01022166 hartree
nucrepener: 2170.73143164 hartree
electener: -4807.74165329 hartree
oneelecener: -7953.07481872 hartree
twoeener: 3145.33316543 hartree
cpcmener: -0.01451188 hartree
kineticenergy: 2631.00518693 hartree
xcener: -154.150972910854 hartree
chargesum: 0.0000000
charge: -0.067814 -0.081518 -0.145337 -0.425028 0.595994 -0.345083 -0.320765 -0.129351 -0.094051 -0.251896 0.257231 0.045246 0.011524 -0.186915 -0.239287 -0.105057 -0.126041 0.064757 0.123952 0.130920 0.080132 0.059450 0.084746 0.092435 0.073100 0.092895 0.105104 0.149665 0.087983 0.077986 0.108585 0.129403 0.147034
qa: -0.0678 -0.0815 -0.1453 -0.4250 0.5960 -0.3451 -0.3208 -0.1294 -0.0941 -0.2519 0.2572 0.0452 0.0115 -0.1869 -0.2393 -0.1051 -0.1260 0.0648 0.1240 0.1309 0.0801 0.0595 0.0847 0.0924 0.0731 0.0929 0.1051 0.1497 0.0880 0.0780 0.1086 0.1294 0.1470
va: 1.2403 1.2191 2.3186 2.0351 5.4148 2.0816 2.0917 3.8824 3.8744 3.9404 3.7367 3.8351 3.9667 4.0322 3.9169 3.9951 4.0035 3.8823 1.0283 1.0048 1.0069 1.0247 1.0009 1.0048 1.0144 1.0177 0.9918 1.0067 1.0053 1.0103 1.0124 1.0155 1.0019
dispcorr: -0.020371494 hartree
energy: -2637.030593149015
dipole: 26.48842 -26.36803 0.12039 -2.42526 2.53344 0.10818 -6.96104 5.38381 -1.57724
magnitude: 1.58552 au
magnitude: 4.03007 debye
