program: Orca
programVersion: 5.0.2
elementType: Cl Cl S S P O O C C C C C C C C C C C H H H H H H H H H H H H H H H
charge: 0
multiplicity: 1
keywords: wb97x-d3
keywords: def2-TZVPP
keywords: def2/J RIJCOSX
keywords: DEFGRID2
keywords: scfconv7
keywords: smallprint printgap noloewdin
keywords: NOSOSCF
formula: C11H15Cl2O2PS2
InChI: InChI=1/C11H15Cl2O2PS2/c1-3-7-18-16(17,14-4-2)15-11-6-5-9(12)8-10(11)13/h5-6,8H,3-4,7H2,1-2H3
33 atoms
Cl -0.512842 -0.986907 -2.067004
Cl -4.857955 1.879184 -0.765174
S  2.768826 -1.631586 1.258995
S  1.417362 0.962274 2.766805
P  1.411301 -0.085912 1.15677
O  0.035692 -0.917145 0.829189
O  1.63311 0.70466 -0.207128
C  2.488786 -2.627551 -0.255442
C  3.171667 -2.089306 -1.498569
C  2.968261 -3.031007 -2.676807
C  -1.098308 -0.245389 0.463154
C  1.836131 2.126087 -0.336437
C  -1.475103 -0.202344 -0.874478
C  -1.897378 0.359986 1.419896
C  0.546835 2.827851 -0.679099
C  -2.636024 0.448681 -1.258619
C  -3.060135 1.014684 1.050595
C  -3.412984 1.059508 -0.288293
H  1.417923 -2.765789 -0.398494
H  2.898234 -3.603628 0.014683
H  2.779395 -1.102358 -1.744153
H  4.238757 -1.965658 -1.302273
H  1.909288 -3.163343 -2.906113
H  3.452345 -2.642074 -3.573171
H  3.388612 -4.01847 -2.477549
H  2.271425 2.525098 0.581151
H  2.57004 2.239572 -1.13334
H  -1.61657 0.306171 2.462902
H  -0.182109 2.755115 0.129017
H  0.754248 3.886078 -0.845308
H  0.101992 2.430518 -1.591669
H  -2.924083 0.477498 -2.300403
H  -3.679155 1.481465 1.804195
elementType: Cl S P O C H
totalener: -2637.01083127 hartree
nucrepener: 2171.29623929 hartree
electener: -4808.30707056 hartree
oneelecener: -7954.11470290 hartree
twoeener: 3145.80763234 hartree
cpcmener: -0.01456956 hartree
kineticenergy: 2631.00372707 hartree
xcener: -154.150230041648 hartree
chargesum: 0.0000000
charge: -0.069233 -0.081415 -0.142634 -0.423601 0.590146 -0.347297 -0.317741 -0.107401 -0.104034 -0.257324 0.257644 0.045379 0.012944 -0.185719 -0.241610 -0.104821 -0.129314 0.065217 0.110500 0.131612 0.065546 0.073389 0.076482 0.093732 0.087461 0.092406 0.104323 0.150725 0.079901 0.108415 0.088796 0.129893 0.147632
qa: -0.0692 -0.0814 -0.1426 -0.4236 0.5901 -0.3473 -0.3177 -0.1074 -0.1040 -0.2573 0.2576 0.0454 0.0129 -0.1857 -0.2416 -0.1048 -0.1293 0.0652 0.1105 0.1316 0.0655 0.0734 0.0765 0.0937 0.0875 0.0924 0.1043 0.1507 0.0799 0.1084 0.0888 0.1299 0.1476
va: 1.2419 1.2191 2.3310 2.0358 5.4202 2.0814 2.0945 3.8665 3.8848 3.9485 3.7403 3.8385 3.9653 4.0323 3.9168 3.9954 4.0064 3.8812 1.0299 1.0048 1.0251 1.0162 1.0025 1.0044 1.0012 1.0172 0.9918 1.0061 1.0090 1.0124 1.0044 1.0154 1.0017
dispcorr: -0.020455984 hartree
energy: -2637.031287249302
dipole: 22.13028 -22.04056 0.08972 -3.96663 3.91694 -0.04968 -9.85328 8.27424 -1.57904
magnitude: 1.58236 au
magnitude: 4.02204 debye
