program: Orca
programVersion: 5.0.2
elementType: Cl Cl S S P O O C C C C C C C C C C C H H H H H H H H H H H H H H H
charge: 0
multiplicity: 1
keywords: wb97x-d3
keywords: def2-TZVPP
keywords: def2/J RIJCOSX
keywords: DEFGRID2
keywords: scfconv7
keywords: smallprint printgap noloewdin
keywords: NOSOSCF
formula: C11H15Cl2O2PS2
InChI: InChI=1/C11H15Cl2O2PS2/c1-3-7-18-16(17,14-4-2)15-11-6-5-9(12)8-10(11)13/h5-6,8H,3-4,7H2,1-2H3
33 atoms
Cl -1.777571 -0.1866 -2.738713
Cl -5.34803 1.925223 0.680419
S  2.288099 -1.41427 -1.151681
S  0.320725 -1.903319 1.614746
P  1.111017 -0.663701 0.387388
O  0.093318 0.169085 -0.58499
O  1.933184 0.469495 1.157559
C  3.195701 -2.726036 -0.249284
C  4.266172 -2.233823 0.706691
C  5.384896 -1.45779 0.034658
C  -1.156991 0.579068 -0.233461
C  2.487959 1.621757 0.482783
C  -2.157601 0.470816 -1.194137
C  -1.461301 1.114587 1.008869
C  3.70764 2.078271 1.238802
C  -3.448892 0.893329 -0.925196
C  -2.751648 1.52874 1.294451
C  -3.735123 1.411771 0.326984
H  3.634121 -3.32604 -1.049357
H  2.457777 -3.350326 0.254676
H  3.815889 -1.640711 1.505565
H  4.67868 -3.122565 1.192935
H  5.018852 -0.550897 -0.448785
H  6.141624 -1.160115 0.761073
H  5.880319 -2.061176 -0.728503
H  2.751752 1.372001 -0.548065
H  1.723781 2.400527 0.45712
H  -0.698076 1.227054 1.767158
H  4.104777 2.975084 0.762103
H  3.471853 2.327582 2.273724
H  4.491199 1.319775 1.231282
H  -4.216443 0.808328 -1.682291
H  -2.97715 1.939414 2.268712
elementType: Cl S P O C H
totalener: -2637.01170522 hartree
nucrepener: 2105.41319482 hartree
electener: -4742.42490004 hartree
oneelecener: -7822.62170563 hartree
twoeener: 3080.19680560 hartree
cpcmener: -0.01731254 hartree
kineticenergy: 2630.99485350 hartree
xcener: -154.147377134943 hartree
chargesum: -0.0000000
charge: -0.064529 -0.083936 -0.156482 -0.398688 0.593192 -0.330952 -0.324401 -0.117237 -0.099003 -0.271540 0.258421 0.009854 -0.024939 -0.171695 -0.235214 -0.086597 -0.129810 0.051720 0.128578 0.130529 0.061533 0.085204 0.068791 0.099214 0.096194 0.109205 0.115643 0.140531 0.093025 0.092823 0.084292 0.128786 0.147489
qa: -0.0645 -0.0839 -0.1565 -0.3987 0.5932 -0.3310 -0.3244 -0.1172 -0.0990 -0.2715 0.2584 0.0099 -0.0249 -0.1717 -0.2352 -0.0866 -0.1298 0.0517 0.1286 0.1305 0.0615 0.0852 0.0688 0.0992 0.0962 0.1092 0.1156 0.1405 0.0930 0.0928 0.0843 0.1288 0.1475
va: 1.2478 1.2168 2.2940 2.0685 5.4057 2.1076 2.0584 3.8723 3.8520 3.9347 3.7846 3.8372 3.9940 3.9613 3.9460 3.9926 3.9925 3.8863 1.0030 1.0274 1.0281 1.0084 1.0076 1.0018 1.0039 0.9975 0.9942 1.0182 1.0068 1.0042 1.0027 1.0167 1.0023
dispcorr: -0.018240559 hartree
energy: -2637.029945776593
dipole: 46.60353 -44.61001 1.99352 -1.92465 2.95362 1.02898 9.90189 -9.95357 -0.05168
magnitude: 2.24401 au
magnitude: 5.70383 debye
