program: Orca
programVersion: 5.0.2
elementType: Cl Cl S S P O O C C C C C C C C C C C H H H H H H H H H H H H H H H
charge: 0
multiplicity: 1
keywords: wb97x-d3
keywords: def2-TZVPP
keywords: def2/J RIJCOSX
keywords: DEFGRID2
keywords: scfconv7
keywords: smallprint printgap noloewdin
keywords: NOSOSCF
formula: C11H15Cl2O2PS2
InChI: InChI=1/C11H15Cl2O2PS2/c1-3-7-18-16(17,14-4-2)15-11-6-5-9(12)8-10(11)13/h5-6,8H,3-4,7H2,1-2H3
33 atoms
Cl -0.838837 -0.088789 -2.590378
Cl -5.325203 0.024861 0.359487
S  1.616879 -1.366306 -0.53249
S  1.477327 0.345479 2.420859
P  1.600077 0.423543 0.501741
O  0.378212 1.19442 -0.271018
O  2.83607 1.230195 -0.096093
C  2.760111 -2.366511 0.499782
C  2.417171 -3.840325 0.367133
C  2.544831 -4.388497 -1.045069
C  -0.94264 0.90101 -0.086044
C  3.409027 2.379544 0.56667
C  -1.646738 0.292534 -1.119791
C  -1.606579 1.254891 1.077895
C  2.524013 3.598357 0.489361
C  -2.998788 0.020058 -0.99025
C  -2.95728 0.986494 1.221912
C  -3.638582 0.36391 0.188844
H  2.659157 -2.043136 1.536049
H  3.779379 -2.164896 0.17107
H  3.100933 -4.377893 1.029503
H  1.410664 -4.01551 0.753439
H  1.823676 -3.937618 -1.729956
H  3.542588 -4.212514 -1.451234
H  2.367323 -5.464223 -1.059107
H  3.636195 2.12064 1.602651
H  4.351415 2.548845 0.048486
H  -1.070998 1.757564 1.870995
H  3.065173 4.450216 0.903212
H  2.259101 3.839449 -0.540114
H  1.608426 3.481785 1.069922
H  -3.537884 -0.453083 -1.799328
H  -3.466714 1.2676 2.133127
elementType: Cl S P O C H
totalener: -2637.00937019 hartree
nucrepener: 2121.33475585 hartree
electener: -4758.34412604 hartree
oneelecener: -7855.07602009 hartree
twoeener: 3096.73189405 hartree
cpcmener: -0.01448501 hartree
kineticenergy: 2631.01305614 hartree
xcener: -154.151845623887 hartree
chargesum: 0.0000000
charge: -0.061630 -0.082712 -0.165028 -0.425251 0.636745 -0.354637 -0.336735 -0.106502 -0.097717 -0.255846 0.268429 0.033321 -0.030226 -0.177776 -0.233221 -0.083697 -0.123688 0.051140 0.119635 0.120822 0.075981 0.072177 0.076787 0.086360 0.092942 0.094424 0.111035 0.149916 0.098657 0.091477 0.076990 0.130700 0.147127
qa: -0.0616 -0.0827 -0.1650 -0.4253 0.6367 -0.3546 -0.3367 -0.1065 -0.0977 -0.2558 0.2684 0.0333 -0.0302 -0.1778 -0.2332 -0.0837 -0.1237 0.0511 0.1196 0.1208 0.0760 0.0722 0.0768 0.0864 0.0929 0.0944 0.1110 0.1499 0.0987 0.0915 0.0770 0.1307 0.1471
va: 1.2495 1.2180 2.3538 2.0202 5.4018 2.0925 2.1111 3.8945 3.9119 3.9309 3.7497 3.8534 4.0230 4.0131 3.8976 3.9921 3.9955 3.8896 1.0325 1.0078 1.0077 1.0158 1.0062 1.0002 1.0044 1.0133 0.9909 1.0068 1.0094 1.0068 1.0139 1.0145 1.0023
dispcorr: -0.016490272 hartree
energy: -2637.025860457607
dipole: 30.57732 -29.48671 1.09061 -6.98665 7.12493 0.13828 6.44845 -6.23701 0.21144
magnitude: 1.11949 au
magnitude: 2.84552 debye
