program: Orca
programVersion: 5.0.2
elementType: Cl Cl S S P O O C C C C C C C C C C C H H H H H H H H H H H H H H H
charge: 0
multiplicity: 1
keywords: wb97x-d3
keywords: def2-TZVPP
keywords: def2/J RIJCOSX
keywords: DEFGRID2
keywords: scfconv7
keywords: smallprint printgap noloewdin
keywords: NOSOSCF
formula: C11H15Cl2O2PS2
InChI: InChI=1/C11H15Cl2O2PS2/c1-3-7-18-16(17,14-4-2)15-11-6-5-9(12)8-10(11)13/h5-6,8H,3-4,7H2,1-2H3
33 atoms
Cl -1.183837 2.987559 -0.780674
Cl -5.331939 -0.215962 0.410882
S  2.165753 -1.623907 -1.038104
S  1.256872 -0.049443 1.877527
P  1.602997 0.076684 -0.007767
O  0.319436 0.522106 -0.921403
O  2.669988 1.157277 -0.485001
C  3.255469 -2.491067 0.1591
C  2.8148 -3.934825 0.334843
C  1.487716 -4.093818 1.0557
C  -0.980132 0.311409 -0.57174
C  2.723842 2.473889 0.119992
C  -1.822587 1.414852 -0.493025
C  -1.489544 -0.954866 -0.332606
C  3.952888 2.593841 0.982552
C  -3.167423 1.260358 -0.198829
C  -2.829061 -1.123781 -0.02605
C  -3.656016 -0.014036 0.037059
H  3.227395 -1.95685 1.109949
H  4.268933 -2.428236 -0.233918
H  2.782886 -4.434459 -0.636727
H  3.603517 -4.435704 0.903134
H  0.675873 -3.589066 0.529036
H  1.217228 -5.147012 1.139188
H  1.533317 -3.68274 2.065368
H  2.74483 3.180781 -0.708815
H  1.820953 2.670621 0.701147
H  -0.845712 -1.822838 -0.399319
H  3.924902 1.891167 1.815722
H  4.863706 2.420077 0.408859
H  4.005174 3.601886 1.396049
H  -3.815751 2.124363 -0.146841
H  -3.216469 -2.116209 0.158202
elementType: Cl S P O C H
totalener: -2637.00943809 hartree
nucrepener: 2116.08942473 hartree
electener: -4753.09886281 hartree
oneelecener: -7844.31328809 hartree
twoeener: 3091.21442528 hartree
cpcmener: -0.01472301 hartree
kineticenergy: 2631.00994346 hartree
xcener: -154.149491553703 hartree
chargesum: 0.0000000
charge: -0.064783 -0.083543 -0.151845 -0.415134 0.627720 -0.346600 -0.338733 -0.089249 -0.085743 -0.256366 0.193097 0.050248 0.040691 -0.119710 -0.235252 -0.116864 -0.174295 0.083410 0.100182 0.127358 0.070273 0.075195 0.065440 0.097652 0.080589 0.109197 0.075315 0.145385 0.076670 0.090753 0.094021 0.129068 0.145855
qa: -0.0648 -0.0835 -0.1518 -0.4151 0.6277 -0.3466 -0.3387 -0.0892 -0.0857 -0.2564 0.1931 0.0502 0.0407 -0.1197 -0.2353 -0.1169 -0.1743 0.0834 0.1002 0.1274 0.0703 0.0752 0.0654 0.0977 0.0806 0.1092 0.0753 0.1454 0.0767 0.0908 0.0940 0.1291 0.1459
va: 1.2461 1.2172 2.3062 2.0171 5.3936 2.1169 2.1063 3.8639 3.8918 3.9457 3.8076 3.8502 3.9715 3.9507 3.9478 4.0318 4.0646 3.8654 1.0422 1.0113 1.0100 1.0083 1.0013 1.0080 1.0042 0.9952 1.0167 0.9972 1.0163 1.0041 1.0074 1.0167 1.0044
dispcorr: -0.017849437 hartree
energy: -2637.027287522670
dipole: 32.18998 -31.00446 1.18552 -16.75101 16.15537 -0.59564 7.69332 -7.79757 -0.10425
magnitude: 1.33083 au
magnitude: 3.38270 debye
